program: Gaussian 09
title: 000197150
version: EM64L-G09RevD.01
frameworkgroup: C1[X(C8H9Br3N2O2)]
method: RPBEPBE
basis: SDD
operation: Freq
keyword: #p
keyword: freq=noraman
keyword: PBEPBE/SDD
title: #p freq=noraman PBEPBE/SDD
converged: YES YES NO NO
title: Mulliken charges:
elementType: Br Br Br O O N N C C C C C C C C H H H H H H H H H
charge: 0.102852 0.133284 0.077640 -0.245989 -0.193002 -0.186057 0.059138 -0.364771 -0.346406 -0.248732 -0.683370 0.328285 -0.032420 -0.158387 -0.200717 0.217805 0.216389 0.199949 0.198885 0.237175 0.237443 0.214415 0.213850 0.222741
chargesum: 0.00000
title: Mulliken charges with hydrogens summed into heavy atoms:
elementType: Br Br Br O O N N C C C C C C C C
charge: 0.102852 0.133284 0.077640 -0.245989 -0.193002 -0.186057 0.059138 0.069423 0.052428 0.225886 -0.032363 0.328285 -0.032420 -0.158387 -0.200717
polarizability: 1.90261721e+02 8.17354578e-02 1.96227070e+02 -1.09624754e+01 1.12581454e+00 8.07225862e+01
1716.lowfreq: -6.1115 -4.1804 0.0002 0.0003 0.0003 0.7401 12.5162 26.7664 41.1413
frequency: 12.2794 26.7511 41.1261 49.7415 59.9149 101.6657 106.2812 107.1591 121.3675 129.7347 168.0082 188.4920 225.5826 228.3976 234.2044 247.2743 285.1325 314.3395 388.9374 405.4638 458.6357 495.0830 586.2185 635.2958 651.3311 713.5115 741.9222 782.6967 796.8333 871.7827 906.9738 916.8092 929.8666 1029.7025 1039.7429 1079.6589 1125.0370 1146.4507 1156.0587 1168.1975 1212.1741 1215.0937 1263.7943 1271.7948 1275.7799 1286.4343 1343.6941 1371.6325 1393.4307 1393.8734 1468.5388 1470.9129 1472.6949 1477.3702 1479.7689 1490.6272 1655.5379 2971.2954 2978.7009 2995.5413 3009.1868 3015.6569 3051.1047 3074.3875 3080.7987 3086.5444
redmass: 5.0606 8.2236 2.2652 8.9779 3.1272 5.4921 2.8600 9.6413 5.2322 15.2645 5.0153 6.4499 1.4704 6.5773 5.2915 7.1111 13.3752 8.5571 10.3478 3.1453 10.0852 8.3652 12.4367 12.2883 12.6971 11.5817 1.0714 9.4505 1.1455 7.8205 2.0605 7.6710 1.1689 9.8048 3.5326 2.2652 2.6435 1.4880 10.9116 9.8769 1.3789 10.4157 2.9147 1.2768 1.6133 1.0795 1.4537 1.5561 3.6252 1.5899 1.0953 10.8303 1.0657 1.0420 1.0639 1.0918 11.9417 1.0591 1.0364 1.0600 1.0566 1.1007 1.1038 1.1021 1.0994 1.1081
irintensity: 0.0209 0.0327 0.1752 1.3452 0.1649 0.4093 0.8054 0.0218 0.6283 0.5863 0.3367 3.9082 0.2630 0.0921 7.0104 2.2807 4.4699 1.3837 3.2156 12.3329 3.4876 3.2290 8.7828 8.6895 8.3353 13.4946 8.8693 11.9097 0.5487 11.7249 12.1700 76.0800 0.9473 125.6757 83.5250 16.2942 0.7700 6.0711 296.2208 200.2385 2.0866 186.2484 265.0287 55.6711 156.0126 0.4107 11.6955 19.1000 113.4222 67.1679 1.9646 38.6917 1.2109 13.9098 4.6101 22.2663 280.6660 26.9113 29.0188 16.3154 29.3399 7.2863 3.6400 31.2130 45.9076 73.1853
temp: 298.150 k
press: 1.00000 atm
elementType: 35 35 35 8 8 7 7 6 6 6 6 6 6 6 6 1 1 1 1 1 1 1 1 1
symmnumber: 1
zpe: 427545.5 jmol-1
zpe.correction: 0.162843 hartree
zpe.thermalcorrener: 0.180055 hartree
zpe.thermalcorrenthalpy: 0.180999 hartree
zpe.thermalcorrgfe: 0.111894 hartree
zpe.sumelectzpe: -609.403955 hartree
zpe.sumelectthermal: -609.386743 hartree
zpe.sumelectthermalent: -609.385799 hartree
zpe.sumelectthermalfe: -609.454904 hartree
dipole: -5.6886 -1.0417 -0.2104
dipole: 5.7870
quadrupole: -105.7247 -115.2126 -116.9206
quadrupole: -0.7521 1.7083 -4.1142
quadrupole: 6.8946 -2.5933 -4.3013 -0.7521 1.7083 -4.1142
hfenergy: -609.5667981 hartree
pointgroup: C01 [X(C8H9Br3N2O2)]
dipole: 2.2664722 -0.189968 -0.1035334 debye
dipolederiv: -0.159499 0.2748007 0.1764682 0.2136203 -0.1909567 -0.1356095 0.1960088 -0.1884932 -0.0262232 0.0342794 0.0383114 0.0085635 0.1061782 -0.5142151 -0.1969108 0.0396011 -0.2312116 0.0036119 -0.1925295 -0.2616431 -0.0116137 -0.3325138 -0.3890939 -0.0285498 -0.0173789 -0.0388464 0.0300194 -1.8900987 0.1272716 -0.0936704 0.4462595 -0.4818529 0.1072234 -0.2077583 0.091476 -0.2760748 -0.7158741 -0.1427373 0.0164626 -0.0413538 -0.868425 0.2144586 -0.0639858 0.1925866 -0.3401596 -1.6266644 -0.4488647 0.2271164 -0.5902162 -0.7173509 -0.0072807 0.3342598 -0.0483701 -0.1051655 -0.6189364 -0.2993837 0.0255787 -0.3907101 -1.1148253 -0.2012204 -0.0003764 -0.2058158 -0.1996382 -0.162615 0.0303458 -0.0028738 0.0105637 0.0329484 0.025071 0.0258133 0.0293913 0.1361581 0.1128453 0.0273244 -0.009869 0.1417392 0.0745849 0.0308057 -0.045496 0.0260494 0.1726471 1.1294777 -0.0162496 0.0175809 0.0853636 0.2388662 0.0205434 -0.0115035 0.0253605 0.3271325 -0.047821 0.0505465 -0.0119574 -0.0022641 0.0392692 0.0125504 0.0058101 0.012449 0.0876424 2.5609491 0.3643102 0.0313645 -0.0449342 1.3725537 -0.4394954 0.1471226 -0.3828241 0.4312194 0.4469161 -0.3745433 -0.2909566 0.019446 0.4183177 0.2136081 -0.3389874 0.2911561 0.1258822 0.8306317 0.3358434 -0.1157689 -0.3158614 1.1591643 0.4273785 -0.2678702 0.3622011 0.1256078 0.2318951 0.4115794 0.0294804 0.8835911 1.0228141 0.0574656 0.1811819 0.1570491 -0.0861439 0.0737234 -0.0350422 -0.0234606 -0.0285429 -0.0655938 -0.0923917 -0.0522422 -0.1034841 -0.0014078 0.0671195 -0.0122184 0.0253119 0.0091133 0.0416301 0.0630066 0.0392168 0.0754708 -0.1117095 0.0274496 0.0039323 -0.0030939 -0.0390346 -0.1071543 -0.1108546 -0.0248127 -0.131602 -0.0086701 0.034102 0.00784 -0.0016347 -0.0131778 0.0225686 0.090858 0.0337028 0.112371 -0.1497715 -0.0501009 0.0045071 0.00094 -0.0569491 -0.0346446 -0.0721832 0.0057508 -0.0868652 0.0072364 -0.0520897 0.0016516 -0.0152254 -0.040142 0.0445021 0.040072 0.0200053 0.0602046 -0.088302 0.0902426 -0.0073251 0.0534537 0.0292072 0.0406187 0.0728484 0.0016417 0.0992381 -0.1398689 0.0881512 -0.0414516 -0.0491119 0.0162676 -0.0790901 -0.1069283 -0.0232405 -0.1313129 -0.0138294 -0.2115542 -0.0388052 0.0169153 -0.0656497 0.0553646 0.0155349 0.023537 0.0138219 0.0998072 unknown
polarizability: 188.6200764|3.5147975|190.3835452|-17.0001368|25.0685949|88.2077558 unknown
InChI: InChI=1S/C8H9Br3N2O2/c1-2-3-4-15-8(14)13-6(10)5(9)12-7(13)11/h2-4H2,1H3
charge 0 multiplicity 1
24 atoms
Br -0.357559 -2.308855 -1.116905
Br -2.607135 2.728997 0.990242
Br -3.930588 -2.76161 -0.119033
O  1.076355 0.198802 0.040966
O  0.117129 2.235358 -0.587567
N  -1.219548 0.346622 -0.073321
N  -3.408977 0.025367 0.47482
C  3.450607 -0.342479 0.127629
C  4.908476 0.151117 -0.040033
C  2.451175 0.769801 -0.178457
C  5.936473 -0.964209 0.246363
C  0.03299 1.041628 -0.248024
C  -1.526554 -1.028975 -0.320759
C  -2.42513 0.919096 0.404295
C  -2.868747 -1.175525 0.014541
H  3.264855 -1.200095 -0.546511
H  3.293063 -0.702265 1.162117
H  5.091064 1.006398 0.641396
H  5.055659 0.533115 -1.070537
H  2.564335 1.639691 0.493751
H  2.510524 1.121633 -1.224827
H  5.830804 -1.346445 1.278688
H  5.799459 -1.817274 -0.443966
H  6.970769 -0.594994 0.126533
