program: Gaussian 09
title: 000189236
version: EM64L-G09RevD.01
frameworkgroup: C1[X(C14H29NO5)]
method: RPBEPBE
basis: SDD
operation: Freq
keyword: #p
keyword: freq=noraman
keyword: PBEPBE/SDD
title: #p freq=noraman PBEPBE/SDD
converged: NO YES NO NO
title: Mulliken charges:
elementType: O O O O O N C C C C C C C C C C C C C C H H H H H H H H H H H H H H H H H H H H H H H H H H H H H
charge: -0.332769 -0.493689 -0.458991 -0.472672 -0.211404 -0.568182 -0.052842 -0.104608 -0.216514 -0.119224 -0.375488 -0.402405 -0.377072 -0.267594 -0.372872 -0.352850 -0.393610 -0.356605 -0.044515 -0.695393 0.246352 0.226078 0.241401 0.215971 0.192895 0.195196 0.216179 0.198637 0.195727 0.195149 0.200907 0.198787 0.191419 0.190317 0.188653 0.189165 0.237905 0.236958 0.195170 0.195544 0.372325 0.281942 0.307279 0.182501 0.376029 0.210090 0.216319 0.209900 0.364505
chargesum: 0.00000
title: Mulliken charges with hydrogens summed into heavy atoms:
elementType: O O O O O N C C C C C C C C C C C C C C
charge: -0.332769 -0.121364 -0.082963 -0.108167 -0.211404 0.021039 0.193510 0.121470 0.024886 0.096747 0.012603 0.012411 0.013805 0.132099 0.008864 0.024967 0.081253 0.034109 0.137986 -0.059083
polarizability: 2.15770870e+02 -3.40813503e+00 1.73984479e+02 -1.52851739e+00 -1.38348084e-01 1.47966284e+02
1716.lowfreq: -20.7953 -7.7389 -0.0007 -0.0003 0.0010 2.7353 5.3134 15.8411 25.7864
frequency: -18.1581 14.8373 25.4743 30.2362 43.6346 53.4416 65.9051 70.7970 81.5891 98.2546 114.8297 126.8900 131.0675 139.8954 149.7195 156.4708 179.9000 190.5375 199.3692 230.8589 231.8318 247.2494 270.9268 280.0838 291.8887 332.0765 333.1808 355.2034 366.2681 378.6083 409.5631 455.8436 463.4586 500.8716 525.7598 553.6691 612.4978 653.1742 698.3203 719.5730 727.9649 745.1112 752.2579 773.7864 797.1177 802.7157 828.3277 861.2480 887.7446 901.5019 931.8828 936.8723 947.7330 951.1623 988.2520 1000.4713 1007.9148 1014.5530 1026.0916 1033.9802 1047.6986 1050.0872 1061.3380 1077.2394 1078.8343 1083.7077 1091.1357 1123.6929 1142.5096 1147.4706 1166.3675 1188.0174 1203.8325 1217.5184 1223.3069 1226.2031 1251.9587 1259.4299 1260.3651 1273.0393 1276.0224 1280.7486 1289.3773 1290.3514 1292.3865 1299.2034 1306.8278 1315.7108 1330.8244 1335.7090 1340.7134 1351.4762 1353.4403 1354.1467 1354.7943 1377.0000 1385.4007 1389.1035 1392.5168 1419.0606 1460.0997 1460.9715 1465.0403 1468.9557 1471.2524 1475.6208 1477.2811 1482.0493 1487.5402 1490.6680 1627.6857 1644.0226 2919.3014 2933.9946 2950.1355 2952.0547 2955.1549 2959.1943 2962.0339 2966.9828 2967.9977 2971.5588 2973.7483 2979.8655 2984.7585 2992.9578 2993.2575 2996.7062 3005.4582 3022.0019 3022.3154 3036.7453 3052.6979 3067.9747 3070.8971 3105.2577 3298.9889 3418.0975 3420.8745 3545.1272 3592.8487
redmass: 1.6083 4.4166 4.3775 5.6417 4.8858 5.3888 1.7395 5.0871 3.0725 2.8995 2.3436 3.9519 2.5760 2.0976 2.9410 3.3667 3.9370 3.2404 5.2036 1.3272 3.1468 4.1894 1.7098 2.4821 2.1695 1.9528 2.2609 2.8268 3.4377 4.0396 4.3624 3.5468 3.2534 3.6514 4.9402 3.8901 2.8793 1.2153 1.1296 1.0618 1.0817 3.2285 1.1334 2.5800 1.1916 2.1976 1.9427 1.1996 1.9273 1.8553 5.1806 1.1964 4.7351 2.0712 4.6537 4.8931 1.1663 5.2442 3.6879 2.2307 3.1567 2.4707 2.5517 2.5033 2.3459 2.1948 1.6715 2.8066 1.6948 1.4732 2.0951 1.6709 1.7898 1.2971 1.3985 1.4122 1.1874 1.2660 1.2899 1.1850 1.0598 1.0988 1.1232 1.1670 1.1072 1.2719 1.2459 1.1806 1.2308 1.3132 1.3775 1.6052 1.5101 1.3182 1.2877 1.3408 1.4004 1.2162 1.3818 1.6520 1.0713 1.0733 1.0696 1.0812 1.0842 1.0794 1.0426 1.0836 1.0858 1.0925 5.3902 1.1706 1.0872 1.0576 1.0587 1.0587 1.0591 1.0814 1.0591 1.0816 1.0587 1.0364 1.0857 1.0632 1.0967 1.0941 1.0991 1.0913 1.1023 1.1043 1.0610 1.1048 1.1048 1.1007 1.0993 1.1062 1.0663 1.0472 1.0638 1.0942 1.0667
irintensity: 0.0727 0.3523 0.4861 0.5126 0.3811 4.5522 0.3854 0.0263 0.1361 0.7877 1.0898 1.9609 0.1134 0.9061 34.9504 3.4149 11.3821 17.3282 3.4411 1.7629 7.1960 33.3460 152.4932 18.8361 39.7243 14.6335 18.8625 2.5160 10.1787 17.6789 2.6621 1.6685 2.3888 2.7699 0.8222 2.3118 22.1367 106.5781 136.9667 13.9647 0.1389 3.3577 5.6232 38.7425 0.1461 191.9517 8.1261 0.2252 1.7382 7.5016 70.2503 0.6327 12.9766 31.7722 49.2165 86.9845 3.2498 63.6910 35.1997 41.0736 3.8245 29.6695 13.2812 9.9461 10.7745 13.6429 15.6173 4.8287 10.6298 5.2501 7.7090 0.1904 9.9041 9.1840 0.3415 4.7036 6.4901 0.7921 1.0134 12.8146 0.9478 0.9484 0.4219 5.8112 0.3214 0.6074 17.6771 39.2190 4.1330 1.4173 6.6079 2.4749 3.1419 10.9871 3.3945 5.5927 20.3245 10.8597 65.4359 1.9053 0.0102 0.0161 0.5114 0.5005 10.5433 2.6429 12.4819 1.0486 14.7559 18.8924 109.8144 96.3334 77.5928 39.8892 0.0839 2.8776 0.0694 4.4406 25.2868 19.1379 134.3696 36.4577 34.7993 54.2717 0.2878 62.8447 8.7410 34.9736 0.1584 0.8782 39.1048 62.5709 125.5514 97.4948 54.0004 23.4054 322.0945 1.1334 150.9402 9.6310 16.6727
temp: 298.150 k
press: 1.00000 atm
elementType: 8 8 8 8 8 7 6 6 6 6 6 6 6 6 6 6 6 6 6 6 1 1 1 1 1 1 1 1 1 1 1 1 1 1 1 1 1 1 1 1 1 1 1 1 1 1 1 1 1
symmnumber: 1
zpe: 1110967.1 jmol-1
zpe.correction: 0.423145 hartree
zpe.thermalcorrener: 0.447584 hartree
zpe.thermalcorrenthalpy: 0.448528 hartree
zpe.thermalcorrgfe: 0.366154 hartree
zpe.sumelectzpe: -980.041243 hartree
zpe.sumelectthermal: -980.016805 hartree
zpe.sumelectthermalent: -980.015861 hartree
zpe.sumelectthermalfe: -980.098234 hartree
dipole: 3.1744 -2.3287 -0.1377
dipole: 3.9393
quadrupole: -130.7037 -130.5798 -125.2968
quadrupole: 16.1388 -1.8734 -14.2375
quadrupole: -1.8437 -1.7197 3.5633 16.1388 -1.8734 -14.2375
hfenergy: -980.4643883 hartree
pointgroup: C01 [X(C14H29N1O5)]
dipole: -1.251562 0.899214 0.16436 debye
polarizability: 215.8182909|-3.2483076|172.7629387|-0.7024992|5.4823642|149.140404 unknown
InChI: InChI=1S/C14H29NO5/c1-2-3-4-5-6-7-8-20-14(11(15)9-16)13(19)12(18)10-17/h9,11-14,17-19H,2-8,10,15H2,1H3
charge 0 multiplicity 1
49 atoms
O  1.048459 0.010272 -0.267868
O  4.307511 -0.22068 0.269161
O  1.913233 2.59515 -0.466171
O  5.209632 2.175049 1.225973
O  3.355403 -3.400656 0.654225
N  3.80239 -2.035187 -1.902406
C  2.258009 -0.286097 -1.083348
C  3.422999 0.602586 -0.571691
C  2.619411 -1.797057 -1.057509
C  2.952226 1.844219 0.238788
C  -2.742559 -0.471662 -0.539049
C  -1.377998 0.099501 -0.08789
C  -3.935561 0.203935 0.173991
C  -0.200269 -0.580194 -0.793497
C  -5.307362 -0.339169 -0.285214
C  -6.499384 0.33362 0.431985
C  4.110345 2.831457 0.463739
C  -7.873842 -0.196347 -0.036693
C  2.745768 -2.336891 0.386347
C  -9.058273 0.48088 0.68611
H  2.039792 -0.015284 -2.136387
H  3.983888 0.95076 -1.464616
H  1.765578 -2.340265 -1.516203
H  2.580159 1.475526 1.219679
H  -2.854299 -0.345672 -1.636278
H  -2.771841 -1.564002 -0.344522
H  -1.259672 -0.02781 1.00574
H  -1.345117 1.188855 -0.289931
H  -3.833765 0.064172 1.270383
H  -3.896786 1.298696 -0.004944
H  -0.214021 -1.672087 -0.596473
H  -0.247906 -0.423187 -1.893966
H  -5.346527 -1.435027 -0.111421
H  -5.410564 -0.194382 -1.381209
H  -6.455926 1.430735 0.266894
H  -6.403715 0.180806 1.527544
H  4.55708 3.13293 -0.497329
H  3.744382 3.73257 0.988795
H  -7.969278 -0.041854 -1.131043
H  -7.916725 -1.292641 0.126998
H  4.940982 0.41358 0.724328
H  3.896645 -3.021675 -2.169773
H  4.646214 -1.711758 -1.408062
H  2.217294 -1.750317 1.175289
H  1.13674 1.966508 -0.489219
H  -9.005396 0.311321 1.778281
H  -10.02888 0.089039 0.330227
H  -9.052329 1.574353 0.516805
H  5.058158 2.292375 2.196032
