program: Gaussian 09
title: 000197198
version: EM64L-G09RevD.01
frameworkgroup: C1[X(C20H25NO2)]
method: RPBEPBE
basis: SDD
operation: Freq
keyword: #p
keyword: freq=noraman
keyword: PBEPBE/SDD
title: #p freq=noraman PBEPBE/SDD
converged: NO YES NO NO
title: Mulliken charges:
elementType: O O N C C C C C C C C C C C C C C C C C C C C H H H H H H H H H H H H H H H H H H H H H H H H H
charge: -0.241452 -0.440108 -0.078536 0.198413 -0.082468 -0.173611 -0.469550 -0.611092 0.318583 -0.403530 0.278726 -0.799582 -0.798273 -0.451446 -0.544721 -0.371589 0.208085 0.270041 -0.426442 0.169539 -0.353163 -0.188439 -0.813806 0.209732 0.212774 0.212960 0.201081 0.236334 0.231568 0.214430 0.230459 0.218843 0.212949 0.233540 0.208782 0.229907 0.240255 0.206070 0.219747 0.259587 0.232656 0.218607 0.352185 0.255778 0.254499 0.224327 0.259778 0.227574
chargesum: 0.00000
title: Mulliken charges with hydrogens summed into heavy atoms:
elementType: O O N C C C C C C C C C C C C C C C C C C C C
charge: -0.241452 -0.087923 -0.078536 0.198413 0.127264 0.039164 -0.055509 -0.143190 0.318583 0.041359 0.278726 -0.134250 -0.119330 -0.025630 -0.285134 -0.138933 0.208085 0.270041 -0.207835 0.169539 -0.097385 0.066060 -0.102127
polarizability: 2.62371869e+02 1.78520237e+01 2.11725823e+02 -6.03411712e-01 -8.90683167e+00 1.86141426e+02
1716.lowfreq: -6.6034 -0.0005 -0.0004 0.0002 10.2169 20.1125 27.2067 28.1714 53.1855
frequency: 26.9712 27.1877 53.0914 56.4301 91.8570 99.0552 113.7426 171.5507 180.6687 199.9646 214.7113 219.7074 223.5438 240.8541 264.9206 267.7339 276.4430 288.9512 305.6560 321.6668 338.1219 347.5463 367.9150 377.0513 404.1317 436.7919 439.8420 471.8360 478.0335 496.4752 500.0507 536.2999 581.7868 598.8805 623.9464 628.3281 657.2177 685.4088 688.4640 726.1900 727.2250 744.6057 757.8117 782.9131 792.5217 807.1838 839.3823 855.6020 865.4153 880.8330 887.7507 910.4352 920.9333 933.7324 934.6813 962.2189 974.7281 996.2350 1013.4397 1015.6664 1020.6869 1033.8383 1048.7523 1060.3028 1075.5790 1083.5037 1105.8548 1118.5834 1129.5669 1136.3090 1146.1818 1151.9425 1154.0323 1173.2370 1184.5045 1193.9623 1201.0499 1213.3959 1232.5308 1241.7691 1244.2130 1250.9580 1258.6183 1278.9040 1294.5420 1310.8039 1321.9100 1338.9287 1345.5824 1348.8460 1364.6969 1379.8205 1384.3550 1387.8422 1396.6299 1398.7162 1408.8786 1439.5568 1449.0702 1452.0877 1461.2814 1468.4391 1471.4257 1483.1308 1483.8969 1484.6574 1485.7533 1487.4700 1493.5562 1499.2869 1588.1817 1624.6178 1630.4151 2869.8887 2885.2498 2956.9814 2973.2996 2974.2773 2975.5114 2977.5281 2978.1368 2986.7092 2989.9412 3003.8978 3028.8905 3041.1348 3050.0172 3061.8528 3064.4598 3080.4159 3083.6498 3090.2445 3105.5905 3129.3680 3167.7612 3210.0009 3262.5012 3583.7017
redmass: 4.1591 5.0307 4.2187 3.9578 4.3385 1.0439 3.7126 2.3366 2.6748 1.7903 4.4659 2.4198 3.3060 2.6515 1.6803 2.4582 2.2347 2.3312 1.7899 2.6782 3.2115 1.1144 2.6787 2.8764 3.9779 3.5902 3.5444 3.7670 2.8094 4.2119 3.3534 3.6195 3.2774 3.8254 3.9435 3.6319 4.2420 5.5149 4.0400 1.3714 3.3286 3.0826 3.9566 2.8557 1.5066 2.3781 2.1215 1.3092 4.2762 1.8212 2.2295 2.4896 1.6497 2.2668 1.7485 2.0822 1.5663 1.7555 2.2207 1.7441 1.5286 2.3179 1.4861 2.4278 2.6889 2.1561 2.4776 1.9890 2.2182 1.8335 1.4260 1.6391 1.7835 2.0773 1.7860 1.5925 2.4081 2.3516 1.5935 1.4723 1.6599 2.5074 1.5808 1.4383 1.6636 1.4585 1.4212 1.5977 1.4666 1.5251 1.4051 1.5792 4.5345 1.2643 1.2229 1.2442 2.9505 1.9050 1.0908 1.3780 1.1021 1.1028 1.0702 1.1193 1.0636 1.0669 1.0777 4.7973 1.8135 1.2437 7.1664 7.1599 6.4857 1.0691 1.0706 1.0651 1.0382 1.0418 1.0770 1.0402 1.0579 1.0826 1.0860 1.0976 1.0878 1.1025 1.0972 1.0987 1.0978 1.0991 1.0988 1.0986 1.0866 1.0970 1.0907 1.0932 1.1059 1.0660
irintensity: 0.4848 0.2085 0.0890 0.8909 0.2760 0.4061 3.4901 0.3564 1.0957 0.1653 0.6207 0.3617 2.7846 3.0543 0.6211 2.7475 4.1570 0.9065 1.4786 2.4428 10.3498 132.6197 8.6366 1.8690 6.2116 0.8733 3.1055 6.5826 4.0485 3.5635 0.5541 0.4681 1.4140 3.0797 5.3459 3.6627 4.2166 0.0927 4.1666 61.8638 10.5624 3.5002 26.4465 9.8810 31.7760 10.5244 8.0751 8.8493 9.5281 6.5141 13.5923 40.4374 13.6523 5.3758 6.6166 13.0857 9.0480 1.3123 11.8405 5.4797 3.5280 2.6253 7.6705 23.6281 37.3020 10.9013 20.9704 10.2933 26.0170 22.4663 13.0277 127.0480 37.7841 0.2203 9.0560 7.1015 11.3212 15.0775 1.5907 2.6117 6.9638 9.1460 4.0226 25.4617 27.4889 10.0319 2.5601 23.9819 4.8529 16.7290 4.0770 7.0471 13.2719 12.2617 15.8544 20.2661 5.4453 6.0379 3.3235 17.7624 5.9074 5.2208 10.9122 2.5185 2.4257 23.2816 9.8056 10.7170 61.5814 24.0408 29.4674 0.9847 53.0730 48.1038 73.3346 9.9924 40.2043 5.3313 9.3361 37.0223 81.7995 31.9903 58.0404 28.0164 34.8061 32.4446 20.6047 45.0847 29.8463 48.6461 22.5145 7.2232 15.9666 25.7422 4.3814 4.3400 1.1738 35.7135
temp: 298.150 k
press: 1.00000 atm
elementType: 8 8 7 6 6 6 6 6 6 6 6 6 6 6 6 6 6 6 6 6 6 6 6 1 1 1 1 1 1 1 1 1 1 1 1 1 1 1 1 1 1 1 1 1 1 1 1 1
symmnumber: 1
zpe: 1062200.2 jmol-1
zpe.correction: 0.404571 hartree
zpe.thermalcorrener: 0.425903 hartree
zpe.thermalcorrenthalpy: 0.426848 hartree
zpe.thermalcorrgfe: 0.354866 hartree
zpe.sumelectzpe: -980.590191 hartree
zpe.sumelectthermal: -980.568858 hartree
zpe.sumelectthermalent: -980.567914 hartree
zpe.sumelectthermalfe: -980.639895 hartree
dipole: -0.0326 -0.0420 1.1182
dipole: 1.1194
quadrupole: -131.3938 -130.2619 -135.6143
quadrupole: 10.5952 -8.1010 -1.8527
quadrupole: 1.0296 2.1614 -3.1910 10.5952 -8.1010 -1.8527
hfenergy: -980.9947613 hartree
pointgroup: C01 [X(C20H25N1O2)]
dipole: -0.0246499 0.058472 0.4358249 debye
polarizability: 263.4496546|16.3796909|207.1178235|-1.6921023|-12.0638719|189.6716398 unknown
InChI: InChI=1S/C20H25NO2/c1-13-6-9-23-19(13)12-21-8-7-20(3)14(2)18(21)10-15-4-5-16(22)11-17(15)20/h4-6,9,11,14,18,22H,7-8,10,12H2,1-3H3
charge 0 multiplicity 1
48 atoms
O  3.79561 -2.034155 0.601387
O  -5.283239 -1.666348 -1.231545
N  1.249139 0.455799 0.395268
C  -1.269568 1.241638 -0.935007
C  -0.578141 2.117185 0.164545
C  0.177094 1.180081 1.140939
C  -0.13585 0.438882 -1.664676
C  -0.837589 0.269821 1.899115
C  -2.238473 0.238422 -0.276257
C  0.73523 -0.393639 -0.708192
C  -1.99165 -0.248415 1.043605
C  -1.96914 2.144823 -1.982124
C  -1.541971 3.067538 0.908143
C  2.208344 -0.255281 1.279548
C  -3.347456 -0.264706 -0.997003
C  -2.867199 -1.216833 1.591595
C  3.466926 -0.653083 0.560908
C  -4.20559 -1.230042 -0.43291
C  -3.971697 -1.718122 0.873527
C  4.432993 0.034834 -0.1633
C  5.409952 -0.953396 -0.592423
C  4.996107 -2.182723 -0.113495
C  4.459872 1.517022 -0.439477
H  0.195681 2.726197 -0.346788
H  0.699059 1.806078 1.893116
H  0.508303 1.165495 -2.198582
H  -0.589626 -0.230448 -2.420998
H  -1.256122 0.848752 2.748207
H  -0.301274 -0.582889 2.3615
H  0.156466 -1.26763 -0.32264
H  1.603457 -0.801145 -1.257896
H  -1.284061 2.954494 -2.296799
H  -2.241255 1.577133 -2.890933
H  -2.889726 2.606293 -1.584063
H  -1.016757 3.588925 1.731171
H  -1.940188 3.84157 0.228825
H  -2.403255 2.526402 1.339609
H  1.784973 -1.184179 1.736169
H  2.448793 0.431844 2.115722
H  -3.569937 0.084549 -2.008666
H  -2.678968 -1.588752 2.606747
H  -4.633143 -2.471137 1.321515
H  -5.822871 -2.341043 -0.749923
H  6.304062 -0.75949 -1.183616
H  5.388414 -3.193974 -0.173471
H  4.669231 1.720824 -1.50596
H  3.485543 1.970204 -0.191831
H  5.246898 2.025228 0.150315
