program: Gaussian 09
title: 000197144
version: EM64L-G09RevD.01
frameworkgroup: C1[X(C18H20N2OS)]
method: RPBEPBE
basis: SDD
operation: Freq
keyword: #p
keyword: freq=noraman
keyword: PBEPBE/SDD
title: #p freq=noraman PBEPBE/SDD
converged: YES YES NO NO
title: Mulliken charges:
elementType: S O N N C C C C C C C C C C C C C C C C C C H H H H H H H H H H H H H H H H H H H H
charge: 0.183573 -0.350367 -0.394098 -0.283419 0.254395 0.312928 -0.479794 0.463865 -0.435378 0.103018 0.394249 -0.410009 -0.362933 -0.301467 -0.450382 -0.828680 -0.342641 -0.308122 -0.323848 -0.247151 -0.224129 -0.687416 0.218148 0.228040 0.366858 0.246630 0.230994 0.197874 0.232427 0.239390 0.239104 0.230311 0.241415 0.289554 0.245872 0.211649 0.182794 0.234485 0.234248 0.202909 0.231741 0.213363
chargesum: 0.00000
title: Mulliken charges with hydrogens summed into heavy atoms:
elementType: S O N N C C C C C C C C C C C C C C C C C C
charge: 0.183573 -0.350367 -0.027240 -0.042005 0.254395 0.312928 -0.479794 0.463865 0.010811 0.103018 0.394249 -0.163379 0.065935 -0.301467 -0.217956 -0.119875 -0.053087 -0.062249 0.070595 -0.012666 0.010119 -0.039402
polarizability: 3.67906737e+02 2.52443553e+01 2.72739373e+02 -2.75001727e+01 6.59773793e+00 1.21822404e+02
1716.lowfreq: -4.5330 -0.0011 0.0008 0.0013 3.2631 5.3617 21.4261 23.9276 45.4655
frequency: 21.3872 23.8855 45.4523 59.1595 70.7652 87.2093 106.0295 130.4743 142.4443 151.2098 157.1256 173.0880 206.6466 223.4767 245.5955 249.4516 262.3096 297.7043 324.6482 349.5997 359.1718 389.5284 418.9161 423.2930 424.1644 438.9424 477.9677 488.0888 500.6834 506.1388 553.0088 591.0228 608.8814 649.5619 672.8182 681.5990 710.9907 725.8187 733.8177 758.6790 798.3168 801.8470 813.7076 814.7787 838.0895 853.2640 870.8582 882.7354 903.2481 947.7528 957.1509 972.8117 1006.9241 1017.9778 1020.5003 1030.9595 1039.2906 1044.5287 1059.0727 1070.6037 1090.8523 1115.2858 1118.7703 1142.2273 1152.8222 1168.6977 1172.4284 1181.3233 1222.8557 1246.3418 1252.5713 1263.6571 1283.5591 1287.0643 1303.4455 1326.5009 1351.4413 1354.9239 1369.5792 1383.9260 1390.4131 1392.5292 1402.1353 1408.2529 1424.5657 1449.0511 1458.4317 1466.1893 1470.9901 1471.8641 1479.7003 1484.3294 1492.7105 1500.6244 1501.3024 1539.5686 1571.9052 1593.2072 1601.9814 1620.0428 2862.5608 2876.8243 2964.2397 2978.7118 2989.8477 3001.2197 3015.7719 3034.9549 3050.2679 3071.3374 3084.0385 3093.5431 3125.1947 3131.3267 3144.0386 3153.2013 3159.6843 3171.5201 3172.8789 3415.9555
redmass: 4.7599 4.3472 4.6439 1.8552 4.5443 3.5778 3.0173 4.6396 2.7648 1.5696 1.6805 3.6588 6.1499 4.4086 1.2360 3.2870 3.2351 4.3166 3.9417 5.2454 3.7593 6.5174 5.2141 8.2307 3.8351 5.4058 4.0816 5.2157 5.4230 4.1402 5.4960 3.9282 4.0654 4.7086 3.9433 1.5254 4.7838 6.3462 3.8050 1.5081 2.0842 1.2398 1.3090 1.8622 4.9392 4.2904 1.1265 1.4178 1.7801 1.3355 3.0016 1.3670 1.3388 1.8985 3.1131 2.9909 3.0019 1.4875 3.4455 1.6914 3.5375 2.0357 1.9857 1.8965 3.2560 1.9114 1.1276 1.4641 1.3710 1.8082 1.9959 1.1766 1.9464 1.2165 1.3232 2.3874 1.4376 4.1233 4.5636 1.3221 6.2187 1.3633 1.4627 2.5671 2.4356 1.1815 2.4120 1.0439 1.3091 1.0612 1.0682 1.1067 1.2093 2.5668 1.0914 3.0007 6.0863 2.3729 6.1019 7.4859 1.0719 1.0713 1.0382 1.0376 1.0601 1.0868 1.0870 1.0974 1.1045 1.0978 1.0972 1.1003 1.0894 1.0861 1.0905 1.0835 1.0948 1.0937 1.0988 1.0738
irintensity: 0.5125 0.4462 0.3844 3.1509 0.2043 0.4056 0.4420 0.0280 1.0916 1.2686 2.2405 1.3612 0.9932 4.1367 1.0293 1.5630 0.4487 2.5404 1.4980 5.5159 4.7924 2.0289 5.1265 1.9904 0.7856 2.3220 11.8662 3.8564 9.9934 2.8721 9.5055 6.6587 5.8093 27.9207 1.1877 71.4485 4.1462 0.7680 13.1238 40.2161 68.0788 0.0754 13.0951 16.9215 4.9001 17.9350 84.2415 0.1850 0.4869 0.0131 8.4836 2.4746 1.0619 20.9094 7.6924 26.2405 6.2538 5.5382 12.8451 17.1892 30.8462 6.4491 7.9768 12.8764 80.0408 6.5344 12.3499 1.8071 6.5112 35.2501 5.1614 10.9145 65.2884 55.7468 59.8489 149.7283 20.4611 27.3171 16.9632 4.3552 16.5689 25.2446 11.7168 41.2636 110.2725 37.0159 4.5686 15.2009 53.8384 15.7531 3.1877 15.1010 80.3514 226.2134 4.4408 90.6247 20.3617 249.5464 9.7180 231.2415 83.2534 114.3920 39.2653 36.1924 66.8606 25.2182 24.0905 17.8093 36.9738 53.0090 20.2897 38.3312 22.4394 0.5627 10.2084 155.8972 10.1319 24.6577 22.1970 2.4207
temp: 298.150 k
press: 1.00000 atm
elementType: 16 8 7 7 6 6 6 6 6 6 6 6 6 6 6 6 6 6 6 6 6 6 1 1 1 1 1 1 1 1 1 1 1 1 1 1 1 1 1 1 1 1
symmnumber: 1
zpe: 892356.5 jmol-1
zpe.correction: 0.339881 hartree
zpe.thermalcorrener: 0.360770 hartree
zpe.thermalcorrenthalpy: 0.361714 hartree
zpe.thermalcorrgfe: 0.288677 hartree
zpe.sumelectzpe: -1279.128124 hartree
zpe.sumelectthermal: -1279.107235 hartree
zpe.sumelectthermalent: -1279.106290 hartree
zpe.sumelectthermalfe: -1279.179327 hartree
dipole: 0.6367 0.4161 0.8337
dipole: 1.1286
quadrupole: -113.0123 -127.7295 -142.9159
quadrupole: -1.9378 -0.7683 0.7500
quadrupole: 14.8736 0.1564 -15.0300 -1.9378 -0.7683 0.7500
hfenergy: -1279.4680042 hartree
pointgroup: C01 [X(C18H20N2O1S1)]
dipole: 0.2473422 0.0899571 0.3575931 debye
polarizability: 365.0901782|35.5196304|263.6059711|-22.5198484|40.2827374|133.772365 unknown
InChI: InChI=1S/C18H20N2OS/c1-3-19-10-11-20-14-9-8-12(2)18-16(14)17(21)13-6-4-5-7-15(13)22-18/h4-9,19-20H,3,10-11H2,1-2H3
charge 0 multiplicity 1
42 atoms
S  -3.048899 1.302472 0.54111
O  -0.368945 -2.001379 -1.101781
N  1.708748 -0.521647 -1.063738
N  5.437393 -0.51425 -0.35477
C  -0.501082 0.280644 -0.321042
C  0.933461 0.493784 -0.549429
C  -1.256063 1.388271 0.200474
C  -0.685345 2.650643 0.495988
C  3.148768 -0.432533 -1.308191
C  -1.092203 -1.031145 -0.626528
C  -2.539933 -1.324273 -0.409031
C  1.500346 1.767447 -0.239456
C  4.003198 -0.649285 -0.032345
C  -3.484941 -0.393659 0.091344
C  0.704771 2.802574 0.261344
C  -1.505837 3.803795 1.043156
C  -2.999342 -2.635422 -0.72941
C  -4.845524 -0.753769 0.267809
C  6.345795 -0.536105 0.81524
C  -4.342719 -3.002191 -0.557605
C  -5.272477 -2.054258 -0.05562
C  7.812835 -0.406073 0.37127
H  3.407312 -1.210193 -2.052665
H  3.422637 0.540153 -1.757945
H  1.176041 -1.400982 -1.238342
H  2.567497 1.940236 -0.398157
H  3.743752 0.123643 0.716221
H  3.731455 -1.635166 0.419967
H  1.168289 3.770938 0.485322
H  -2.32085 4.095972 0.352357
H  -1.9809 3.551373 2.011361
H  -0.868728 4.689795 1.203082
H  5.732951 -1.203443 -1.062264
H  -2.254522 -3.338008 -1.114775
H  -5.558502 -0.018139 0.656195
H  6.077223 0.318513 1.46698
H  6.224322 -1.459678 1.435801
H  -4.672901 -4.015137 -0.80996
H  -6.323824 -2.329316 0.082137
H  8.113786 -1.25878 -0.267744
H  7.957423 0.522987 -0.207331
H  8.487929 -0.388009 1.245673
