program: Gaussian 09
title: 000189201
version: EM64L-G09RevD.01
frameworkgroup: C1[X(C13H17N)]
method: RPBEPBE
basis: SDD
operation: Freq
keyword: #pfreq=noraman
keyword: PBEPBE/SDD
title: #p freq=noraman PBEPBE/SDD
converged: YES YES NO NO
title: Mulliken charges:
elementType: N C C C C C C C C C C C C C H H H H H H H H H H H H H H H H H
charge: -0.625029 -0.266118 -0.453461 -0.373159 -0.407821 -0.561147 0.519045 -0.527517 0.423403 -0.397670 -0.391977 -0.240321 -0.249133 -0.244760 0.205244 0.198371 0.207783 0.214865 0.198855 0.202463 0.203091 0.222735 0.230269 0.213863 0.273054 0.268596 0.231273 0.250328 0.223608 0.224017 0.227249
chargesum: 0.00000
title: Mulliken charges with hydrogens summed into heavy atoms:
elementType: N C C C C C C C C C C C C C
charge: -0.083379 -0.060874 -0.047307 0.040561 -0.002266 -0.108143 0.519045 -0.313653 0.423403 -0.166397 -0.141649 -0.016713 -0.025116 -0.017511
polarizability: 2.19984048e+02 2.80580918e+00 1.22161760e+02 -7.74216874e+00 1.66825113e+01 1.08098728e+02
1716.lowfreq: -7.5229 -3.0638 -0.0004 -0.0003 0.0004 7.5555 37.0591 53.6219 91.6696
frequency: 36.8276 53.5515 91.6650 133.0398 163.3705 215.6334 232.8834 267.0771 274.8089 303.7957 355.9384 389.6674 407.8649 447.1985 487.5733 511.8516 559.6882 607.1524 614.7566 632.2972 680.6443 702.2970 744.7690 777.8116 806.9020 816.6114 847.8070 852.6076 871.3909 892.9630 918.4380 926.4672 969.2377 975.5449 987.5300 991.7381 1010.6063 1025.5621 1027.7815 1075.4478 1084.9352 1088.5582 1108.5330 1144.2583 1171.1893 1188.9244 1195.7392 1206.2205 1223.1565 1247.4015 1269.4310 1306.4143 1315.2597 1320.8379 1330.5334 1341.7143 1349.9026 1359.3868 1372.7657 1394.1381 1437.0759 1451.0447 1460.6368 1461.4030 1474.6210 1481.8043 1580.2001 1609.9827 1627.4718 1656.1858 2866.2257 2967.5315 2970.9219 2980.2296 2990.3150 3024.6949 3032.2025 3054.0863 3056.5921 3065.6449 3115.1605 3124.2974 3137.8283 3151.4961 3164.1667 3443.3534 3576.6059
redmass: 3.6224 3.4704 3.8894 3.8090 2.7580 2.6026 2.6461 1.5445 2.3337 2.3288 2.8066 2.4814 2.8648 1.9653 3.3961 2.8964 1.5844 4.2439 5.9304 2.4414 2.4731 1.7662 2.0858 2.4110 3.4640 1.6178 1.8198 1.6200 1.5674 1.9044 1.6254 1.5750 2.3702 1.5603 5.3892 1.3379 2.0135 1.7499 2.1603 1.5833 1.5909 1.9404 1.4032 1.6479 1.0546 1.1675 1.3629 1.4864 2.2689 1.2814 1.3171 1.3696 1.2677 1.4635 1.3901 1.5039 1.5032 1.7407 3.1281 1.8961 2.1770 1.1004 1.0871 1.0879 1.0964 2.2772 5.8103 6.0276 1.1204 6.9373 1.0829 1.0614 1.0617 1.0640 1.0621 1.1004 1.0994 1.1013 1.0871 1.0975 1.0862 1.0866 1.0927 1.0953 1.1008 1.0444 1.0979
irintensity: 0.0950 0.1707 0.4802 2.1697 0.5947 0.3413 11.0443 39.2109 20.0078 3.4788 1.1461 1.0308 0.1502 4.7765 7.0453 12.1437 124.3140 4.7809 0.2885 22.6657 29.4081 48.2075 41.1162 11.3161 5.5198 10.8436 4.1442 0.6312 10.6126 12.3879 4.3152 16.9385 4.2754 2.0823 0.0730 0.6064 18.0872 3.9529 9.3474 3.9644 5.9240 0.2878 5.1247 3.8149 0.0371 2.9885 7.1965 5.9910 4.0314 0.0662 1.8616 7.6648 9.0534 1.5251 3.8333 4.7511 9.7609 6.9443 2.2189 1.2858 5.2562 11.1597 13.0170 3.2915 11.9728 20.2209 1.9793 12.0722 50.1515 19.1315 81.7520 49.1932 43.9813 9.4261 69.5864 43.5194 47.5932 51.3871 23.0091 35.8005 8.0571 0.1281 27.6534 43.1320 17.5296 3.4848 0.2570
temp: 298.150 k
press: 1.00000 atm
elementType: 7 6 6 6 6 6 6 6 6 6 6 6 6 6 1 1 1 1 1 1 1 1 1 1 1 1 1 1 1 1 1
symmnumber: 1
zpe: 703822.2 jmol-1
zpe.correction: 0.268072 hartree
zpe.thermalcorrener: 0.280881 hartree
zpe.thermalcorrenthalpy: 0.281825 hartree
zpe.thermalcorrgfe: 0.228588 hartree
zpe.sumelectzpe: -559.275732 hartree
zpe.sumelectthermal: -559.262923 hartree
zpe.sumelectthermalent: -559.261979 hartree
zpe.sumelectthermalfe: -559.315216 hartree
dipole: -0.8080 -0.8624 0.0802
dipole: 1.1845
quadrupole: -77.4237 -80.6860 -83.8315
quadrupole: 4.6814 -1.4510 1.9751
quadrupole: 3.2234 -0.0390 -3.1844 4.6814 -1.4510 1.9751
hfenergy: -559.543804 hartree
pointgroup: C01[X(C13H17N1)]
dipole: -0.3281633 0.205398 0.2594038 debye
polarizability: 219.6726743|-8.2790845|97.105269|5.1540103|-1.579448|133.4665929 unknown
InChI: InChI=1S/C13H17N/c14-13-9-5-4-8-12(13)10-11-6-2-1-3-7-11/h1-3,6-7,10,13H,4-5,8-9,14H2
charge 0 multiplicity 1
31 atoms
N  -2.957032 1.836058 -0.020189
C  -2.409611 0.705541 0.773155
C  -3.440471 -0.456831 0.77261
C  -3.606574 -1.081466 -0.630438
C  -2.242579 -1.563373 -1.169495
C  -1.200922 -0.406781 -1.209786
C  -1.078884 0.268953 0.146504
C  0.0800 0.476947 0.846017
C  1.484196 0.208029 0.453797
C  2.417268 -0.177989 1.459875
C  1.9735 0.374126 -0.874814
C  3.770119 -0.428799 1.149028
C  3.328317 0.128616 -1.186645
C  4.23289 -0.282709 -0.18004
H  -2.214071 0.988669 1.836444
H  -4.41351 -0.084254 1.154449
H  -3.089428 -1.230529 1.484044
H  -4.023466 -0.323023 -1.319641
H  -4.323252 -1.924643 -0.586421
H  -2.356535 -1.98441 -2.187142
H  -1.855786 -2.377048 -0.522366
H  -1.543395 0.338461 -1.955719
H  -0.22822 -0.803126 -1.546368
H  -0.031225 0.886534 1.863742
H  -2.330198 2.645379 -0.070667
H  -3.915064 2.098472 0.235481
H  2.066663 -0.291612 2.493404
H  1.299076 0.738263 -1.656338
H  4.463915 -0.733584 1.940943
H  3.681782 0.270693 -2.214472
H  5.284098 -0.472667 -0.424053
