program: Gaussian 09
title: 000197054
version: EM64L-G09RevD.01
frameworkgroup: C1[X(C20H18)]
method: RPBEPBE
basis: SDD
operation: Freq
keyword: #p
keyword: freq=noraman
keyword: PBEPBE/SDD
title: #p freq=noraman PBEPBE/SDD
converged: YES YES NO NO
title: Mulliken charges:
elementType: C C C C C C C C C C C C C C C C C C C C H H H H H H H H H H H H H H H H H H
charge: -0.028399 0.012824 0.289125 0.121151 -0.562588 0.158188 0.147730 0.334517 -0.440315 0.155304 -0.450241 0.411797 -0.875030 -0.898471 -0.505136 -0.851210 -0.363098 -0.455333 -0.270320 -0.257645 0.240333 0.238037 0.242511 0.243170 0.234604 0.241264 0.263092 0.222559 0.247634 0.266294 0.235130 0.235698 0.235558 0.229023 0.259188 0.239778 0.225156 0.228118
chargesum: 0.00000
title: Mulliken charges with hydrogens summed into heavy atoms:
elementType: C C C C C C C C C C C C C C C C C C C C
charge: -0.028399 0.012824 0.289125 0.121151 -0.084218 0.158188 0.147730 0.334517 -0.197804 0.155304 -0.207071 0.411797 -0.136069 -0.161984 -0.270006 -0.150931 -0.103910 -0.215555 -0.045164 -0.029527
polarizability: 3.67435885e+02 8.22721375e+00 2.40465117e+02 -1.29058557e+00 -6.08456318e+00 1.01820543e+02
1716.lowfreq: -5.7246 -3.4035 -0.0008 -0.0007 0.0005 2.4076 47.0454 73.2174 96.7314
frequency: 47.0348 73.2123 96.7233 106.7434 153.3052 174.6839 189.6994 216.6127 250.6191 271.7596 277.9804 285.1368 298.0419 319.5750 335.5576 347.5241 390.2470 412.8851 436.6057 450.0537 472.8140 476.1447 522.7561 541.7364 544.9846 557.2433 616.3422 623.4085 625.9723 681.8818 685.8765 715.8208 752.8455 760.0001 770.9843 805.4994 811.4810 826.5760 832.0954 882.4139 914.2223 925.0447 933.3929 955.8842 966.5096 976.9829 987.3752 1012.3872 1015.4802 1026.8572 1039.1812 1044.7012 1048.9152 1049.9707 1074.1306 1108.2621 1110.8258 1143.4722 1165.6962 1177.6041 1202.9251 1232.4699 1239.9176 1259.5039 1275.4882 1319.6573 1331.0815 1355.2692 1389.4173 1390.0838 1393.8518 1396.6019 1400.2287 1406.1850 1414.4116 1422.0961 1447.6764 1462.5930 1466.4096 1476.8188 1479.1466 1495.8969 1497.3927 1514.4476 1529.5461 1567.5392 1581.1708 1616.7446 1620.4106 1626.5632 2965.7741 2968.5646 2969.9535 2971.7909 3008.8774 3050.5519 3054.2511 3060.8268 3076.0239 3097.3866 3118.4046 3121.2017 3132.4013 3137.6273 3147.9671 3156.9392 3170.5846 3204.9074
redmass: 3.9820 3.2816 2.4184 3.0327 1.5428 2.7323 3.6838 3.6404 1.8440 4.7576 1.8270 1.2045 2.3540 2.0138 3.2681 3.8182 3.5668 2.8583 3.8558 2.8058 3.4427 3.6957 5.4672 3.5863 3.2906 4.3133 3.4648 3.9797 5.9692 4.4093 4.7570 3.8025 2.1960 1.4273 1.2707 4.3262 3.2325 4.1997 1.7942 1.6161 4.0123 3.8310 2.2849 1.3874 1.6728 1.3886 1.3543 1.6628 1.4280 1.5685 2.0508 1.5815 2.0022 1.6936 3.5692 1.1945 2.1535 1.9848 1.4664 1.1313 2.6159 2.0292 1.5921 2.1563 1.8220 3.5305 3.5624 5.6437 1.8810 2.1162 4.0130 2.7524 1.5722 1.3098 1.5945 1.4340 2.3543 1.1218 1.1366 1.1257 1.0843 2.5371 1.1477 1.0639 4.2379 7.4869 7.3670 6.2688 6.6713 6.9590 1.0457 1.0607 1.0493 1.0374 1.0977 1.0971 1.0884 1.0886 1.0983 1.0984 1.0867 1.0858 1.0903 1.0919 1.0980 1.0987 1.0960 1.0918
irintensity: 0.1456 0.1358 0.0345 0.9336 0.7068 1.6029 4.1796 4.2949 5.7993 0.1826 0.1840 0.4401 1.5497 0.7070 1.5266 0.5367 1.3828 3.4736 0.8905 0.4705 0.1666 1.6967 0.3136 1.1458 4.6072 0.9935 3.4188 3.2551 4.3507 6.4974 3.0337 2.1696 2.6531 57.4657 24.2558 1.7249 3.8733 2.8522 45.7494 7.7170 4.4667 4.3120 7.3287 4.4603 10.9943 1.1710 1.0123 17.6217 3.1384 22.1561 8.6849 4.6923 2.8352 2.6071 0.2701 0.4274 0.1640 2.2997 4.1344 1.3738 9.7237 2.1515 3.6608 9.8873 4.5696 5.6773 1.2170 0.6839 0.4406 1.0241 0.3419 8.5646 10.1473 23.9481 14.7572 2.2767 16.5248 24.4479 13.8566 10.3246 20.6176 13.4895 11.3821 2.4258 3.4771 2.4266 5.3333 2.6171 5.3255 4.4965 41.7170 14.2313 26.5098 42.8268 10.1497 14.2659 39.1948 9.4920 32.8723 15.5461 1.2268 4.5380 16.9256 10.1270 28.2641 46.1479 15.1823 11.6405
temp: 298.150 k
press: 1.00000 atm
elementType: 6 6 6 6 6 6 6 6 6 6 6 6 6 6 6 6 6 6 6 6 1 1 1 1 1 1 1 1 1 1 1 1 1 1 1 1 1 1
symmnumber: 1
zpe: 822691.9 jmol-1
zpe.correction: 0.313347 hartree
zpe.thermalcorrener: 0.329742 hartree
zpe.thermalcorrenthalpy: 0.330687 hartree
zpe.thermalcorrgfe: 0.270781 hartree
zpe.sumelectzpe: -771.566316 hartree
zpe.sumelectthermal: -771.549920 hartree
zpe.sumelectthermalent: -771.548976 hartree
zpe.sumelectthermalfe: -771.608881 hartree
dipole: -1.1549 0.3015 0.0314
dipole: 1.1940
quadrupole: -104.1536 -102.8247 -123.7762
quadrupole: -0.3267 -0.4985 -1.3525
quadrupole: 6.0979 7.4268 -13.5247 -0.3267 -0.4985 -1.3525
hfenergy: -771.8796623 hartree
pointgroup: C01 [X(C20H18)]
dipole: -0.4529364 0.1243925 0.007524 debye
polarizability: 367.62197|6.6732632|240.2991169|1.6251494|-5.7234346|101.8004586 unknown
InChI: InChI=1S/C20H18/c1-12-8-10-17-18-11-9-15-6-4-5-7-16(15)20(18)14(3)13(2)19(12)17/h4-9,11H,10H2,1-3H3
charge 0 multiplicity 1
38 atoms
C  -1.589896 -1.01023 -0.022495
C  -2.36376 0.173933 -0.086797
C  -0.177021 -0.983247 0.062793
C  0.50735 0.295186 0.069962
C  -2.501521 -2.22245 -0.077389
C  -1.716453 1.445555 0.039863
C  -0.296976 1.496233 0.170422
C  -3.80243 -0.222615 -0.20943
C  -3.873372 -1.595074 -0.202754
C  1.981256 0.270837 -0.018919
C  0.566829 -2.218286 0.185422
C  2.682615 -0.984982 0.156799
C  -2.516211 2.741844 0.072667
C  0.311578 2.845858 0.544258
C  1.939978 -2.21723 0.290643
C  -5.013677 0.675198 -0.322718
C  2.787351 1.405369 -0.362608
C  4.109884 -1.028155 0.122215
C  4.188093 1.337607 -0.421198
C  4.865698 0.119454 -0.143665
H  -2.269948 -2.887535 -0.934444
H  -2.419265 -2.850253 0.833909
H  -4.797087 -2.175866 -0.275418
H  0.01079 -3.161441 0.218329
H  -2.691901 3.08974 1.111071
H  -1.991166 3.556173 -0.455401
H  -3.498708 2.623411 -0.402048
H  0.537535 3.485828 -0.332512
H  -0.388962 3.415645 1.177548
H  1.242245 2.721637 1.119406
H  2.49649 -3.152489 0.423528
H  -5.934764 0.067809 -0.361684
H  -5.102452 1.364636 0.537296
H  -4.98639 1.293486 -1.240331
H  2.311473 2.345191 -0.640703
H  4.606608 -1.992979 0.281561
H  4.759955 2.230717 -0.697219
H  5.959732 0.074185 -0.172457
