program: Gaussian 09
title: 000189195
version: EM64L-G09RevD.01
frameworkgroup: C1[X(C18H38N)]
method: RPBEPBE
basis: SDD
operation: Freq
keyword: #p
keyword: freq=noraman
keyword: PBEPBE/SDD
title: #p freq=noraman PBEPBE/SDD
converged: YES YES NO NO
title: Mulliken charges:
elementType: N C C C C C C C C C C C C C C C C C C H H H H H H H H H H H H H H H H H H H H H H H H H H H H H H H H H H H H H H
charge: -0.080470 -0.340049 -0.348352 -0.358455 -0.448233 -0.442365 -0.397623 -0.587465 -0.415047 -0.380045 -0.387653 -0.390228 -0.386314 -0.387342 -0.381783 -0.374107 -0.352978 -0.356686 -0.693065 0.264411 0.258948 0.259902 0.265134 0.265082 0.265343 0.235476 0.260531 0.259108 0.237226 0.214760 0.261544 0.266104 0.267216 0.273733 0.232513 0.228811 0.207692 0.208876 0.204042 0.200294 0.200295 0.202310 0.196819 0.199077 0.197533 0.196152 0.193379 0.194734 0.191804 0.190887 0.188309 0.189031 0.195376 0.195720 0.220062 0.210185 0.209842
chargesum: 1.00000
title: Mulliken charges with hydrogens summed into heavy atoms:
elementType: N C C C C C C C C C C C C C C C C C C
charge: -0.080470 0.183310 0.176684 0.171970 0.047774 0.053970 0.078681 0.219588 0.046276 0.036523 0.016684 0.012377 0.009582 0.006343 0.006330 0.008584 0.024361 0.034411 -0.052975
polarizability: 2.64270898e+02 2.27871866e-01 1.70832737e+02 -2.45781967e+00 1.58489530e+00 1.65066185e+02
1716.lowfreq: -18.1881 -12.8335 -3.6639 -0.0022 0.0008 0.0014 8.9091 19.4940 23.7886
frequency: -12.7577 18.9539 22.8250 31.5714 50.6909 58.3648 65.8971 87.2465 98.1042 112.4651 122.3736 124.2704 133.1821 147.6248 151.1157 158.7017 188.6671 199.6374 236.3571 248.0695 265.9444 278.5338 316.5877 323.6898 341.6599 391.2011 397.3012 421.8135 441.6813 460.2016 474.1961 493.5807 503.6528 589.0341 686.2568 720.2317 722.3791 728.0880 739.5985 758.4671 772.1680 786.3788 827.7076 832.1167 846.7022 859.4138 875.9160 889.1532 892.8707 931.7354 938.8186 961.5098 976.1807 981.7639 991.1607 994.6742 1003.0113 1015.9696 1031.8728 1034.8724 1046.2332 1055.5828 1064.4011 1076.5993 1079.8589 1080.9855 1089.1854 1110.6758 1113.9208 1121.7008 1129.5576 1172.7688 1179.2321 1180.7729 1188.7891 1204.3006 1207.7751 1223.5199 1235.2068 1240.3204 1258.2160 1263.1862 1265.7818 1276.0355 1280.0033 1284.8370 1288.9282 1289.1440 1293.1375 1296.7948 1299.3904 1303.3465 1314.9277 1327.3984 1332.4309 1336.1815 1345.8194 1348.0112 1352.4934 1353.1794 1356.6403 1357.0716 1362.2270 1370.2371 1390.9536 1393.4294 1430.9457 1451.5909 1459.1525 1459.2851 1461.0649 1462.4422 1463.0020 1464.4118 1465.7366 1467.7487 1468.2612 1470.4785 1473.9233 1478.1697 1478.7699 1482.1605 1483.9342 1485.7525 1488.3645 1489.5298 1496.5200 2950.3188 2950.6010 2952.4514 2954.4464 2956.6679 2960.2659 2964.3731 2968.7139 2970.0753 2973.5604 2983.9545 2988.1131 2992.0952 2993.4711 2993.7075 2999.9150 3004.3036 3005.9108 3007.3495 3008.8722 3016.9914 3018.2357 3021.2044 3028.0818 3035.3039 3037.2844 3044.3621 3055.0237 3060.7549 3062.8356 3069.4991 3074.2140 3077.6058 3083.4227 3092.6923 3104.0159 3145.8796 3159.9049
redmass: 2.6955 3.6776 2.1342 3.0814 1.7044 3.5895 2.9878 1.6789 2.6772 3.3460 1.8627 2.7965 3.0359 2.2166 1.9702 2.2911 2.0057 1.8652 1.1055 1.9613 3.7607 1.9218 2.4348 2.2279 2.2609 2.9053 2.8295 2.1906 2.7575 2.9759 2.6007 2.6515 2.6944 2.1189 3.5928 1.0589 1.0677 1.0812 1.1027 1.1461 1.5949 1.1971 2.4700 1.2547 2.1099 2.1608 1.7009 1.9021 1.6272 1.4674 1.4171 1.9737 2.1685 3.6320 4.4049 1.2395 2.3544 3.6017 1.0941 3.5085 2.8214 2.2876 2.8609 2.5288 2.3393 2.1381 2.5938 1.2583 1.9142 2.2423 1.6293 1.9068 1.6957 1.6144 1.6615 1.3658 1.4173 1.5141 1.3116 1.4110 1.2746 1.2843 1.2737 1.1860 1.0310 1.1109 1.1967 1.1411 1.1427 1.1386 1.1171 1.1308 1.3218 1.3423 1.2978 1.3458 1.3519 1.4709 1.4311 1.6166 1.5844 1.6188 1.3983 1.3492 1.2154 1.3380 1.1547 1.0847 1.0747 1.0747 1.0719 1.0700 1.0717 1.0742 1.0716 1.0773 1.0757 1.0854 1.0838 1.0866 1.0424 1.0904 1.0680 1.0887 1.0894 1.0889 1.0732 1.0586 1.0587 1.0591 1.0592 1.0593 1.0592 1.0589 1.0590 1.0585 1.0362 1.0965 1.0976 1.0588 1.0991 1.0681 1.1010 1.0629 1.0610 1.0598 1.1025 1.0599 1.1036 1.0622 1.1045 1.0378 1.1014 1.1045 1.1046 1.0994 1.0970 1.1007 1.0993 1.1004 1.1074 1.1065 1.1055 1.1040 1.1038
irintensity: 0.0311 0.1066 0.0802 0.2402 0.0342 0.4502 0.4962 0.0002 0.4866 0.4397 0.0335 1.0034 1.0284 0.0394 0.0258 0.1178 0.3786 0.1537 0.0006 0.0477 0.1626 0.2129 0.7293 0.1290 0.4180 0.0544 0.1058 0.4466 0.4304 0.0778 0.4376 0.1406 1.4359 2.1473 3.1715 17.5690 0.8769 7.8132 0.6520 4.2820 3.2302 0.0401 7.8959 1.9339 13.4898 55.7241 3.5733 4.1705 2.6983 17.4932 5.7198 3.8831 8.7095 2.9678 3.7562 1.6048 7.1861 8.8752 0.4155 1.3739 5.9102 0.3347 0.2031 1.4816 0.8282 0.2104 3.2094 0.1065 0.2303 20.2089 0.2273 3.6431 1.5327 3.0708 2.2365 14.5088 6.9339 0.3747 0.7742 0.9707 0.1379 0.7133 6.2486 0.0619 1.8659 0.5157 1.6306 1.6604 1.5239 2.7547 0.2297 1.5268 1.8073 3.7390 0.3277 7.3276 2.7188 0.7443 0.0361 0.2264 0.0119 0.7634 0.5584 3.2251 11.2773 4.5022 23.5205 2.9975 0.0762 0.1954 2.6189 1.2230 2.2881 12.5395 5.2522 13.8527 19.5117 6.2787 0.7753 4.0289 13.1123 0.1590 51.5230 9.4829 13.5804 25.7724 37.5323 0.0010 0.1397 0.5813 0.4480 2.5419 3.5475 25.4111 36.2957 221.6292 38.7763 0.0832 0.0571 23.3575 0.1099 12.4120 0.0041 13.1690 14.1302 14.9286 0.2171 10.1856 0.2438 12.7701 4.6057 1.7831 10.8624 195.3406 61.0420 9.1775 15.0067 93.6967 50.6698 22.9717 20.6568 24.2643 13.0270 3.9877 6.0719
temp: 298.150 k
press: 1.00000 atm
elementType: 7 6 6 6 6 6 6 6 6 6 6 6 6 6 6 6 6 6 6 1 1 1 1 1 1 1 1 1 1 1 1 1 1 1 1 1 1 1 1 1 1 1 1 1 1 1 1 1 1 1 1 1 1 1 1 1 1
symmnumber: 1
zpe: 1396898.1 jmol-1
zpe.correction: 0.532050 hartree
zpe.thermalcorrener: 0.555182 hartree
zpe.thermalcorrenthalpy: 0.556126 hartree
zpe.thermalcorrgfe: 0.477212 hartree
zpe.sumelectzpe: -761.635770 hartree
zpe.sumelectthermal: -761.612638 hartree
zpe.sumelectthermalent: -761.611694 hartree
zpe.sumelectthermalfe: -761.690608 hartree
dipole: 22.5015 -0.5188 0.5790
dipole: 22.5149
quadrupole: 21.5825 -113.2824 -113.8585
quadrupole: -0.4863 2.0037 -1.7311
quadrupole: 90.1020 -44.7629 -45.3390 -0.4863 2.0037 -1.7311
hfenergy: -762.1678202 hartree
pointgroup: C01 [X(C18H38N1)]
dipole: 8.8526105 -0.1659476 0.2620449 debye
polarizability: 264.2810797|0.2883679|171.0234185|-2.2371956|1.1698206|164.8653218 unknown
InChI: InChI=1S/C18H38N/c1-3-4-5-6-7-8-9-10-11-13-16-19(2)17-14-12-15-18-19/h3-18H2,1-2H3
charge 1 multiplicity 1
57 atoms
N  4.892753 -0.181904 0.268114
C  5.969708 -1.162218 -0.269592
C  5.075995 1.195611 -0.413211
C  3.504123 -0.774218 -0.109439
C  7.40391 -0.623206 -0.148933
C  6.504468 1.748211 -0.2804
C  7.552855 0.756051 -0.829327
C  5.004872 -0.059872 1.781956
C  2.273193 0.00316 0.37982
C  0.976155 -0.683218 -0.128029
C  -0.297708 0.053512 0.346424
C  -1.599621 -0.589713 -0.182525
C  -2.870827 0.1493 0.293849
C  -4.177757 -0.468869 -0.251706
C  -5.445806 0.273466 0.22742
C  -6.755595 -0.32888 -0.329095
C  -8.021869 0.414802 0.152631
C  -9.332773 -0.178602 -0.412176
C  -10.591662 0.5697 0.076686
H  5.83441 -2.109212 0.281201
H  5.712205 -1.333325 -1.330424
H  4.818837 1.038326 -1.476468
H  4.33284 1.876353 0.031417
H  3.500118 -0.843696 -1.212573
H  3.49656 -1.801616 0.299086
H  7.722372 -0.572369 0.90898
H  8.068088 -1.364719 -0.629599
H  6.537183 2.697874 -0.845009
H  6.727276 2.010984 0.770805
H  7.424957 0.647721 -1.924677
H  8.570412 1.149993 -0.666345
H  4.757232 -1.032876 2.234128
H  6.027577 0.226946 2.058854
H  4.301391 0.705766 2.13804
H  2.238216 0.042202 1.484666
H  2.281638 1.044726 0.006868
H  0.984355 -0.720627 -1.236604
H  0.94438 -1.734023 0.225762
H  -0.323259 0.071035 1.455586
H  -0.255797 1.112235 0.016092
H  -1.579605 -0.603611 -1.292103
H  -1.648778 -1.649565 0.142874
H  -2.814747 1.21371 -0.016516
H  -2.902391 0.149698 1.403393
H  -4.239041 -1.533718 0.055734
H  -4.150311 -0.466363 -1.361436
H  -5.38022 1.341063 -0.070234
H  -5.480918 0.262138 1.336951
H  -6.824211 -1.396894 -0.033797
H  -6.723509 -0.314952 -1.438759
H  -7.952458 1.484691 -0.136057
H  -8.061008 0.394837 1.262004
H  -9.294932 -0.156117 -1.520527
H  -9.402411 -1.247868 -0.125524
H  -11.513769 0.129781 -0.344986
H  -10.673386 0.53117 1.179388
H  -10.560113 1.635285 -0.219557
