program: Gaussian 09
title: 000197060
version: EM64L-G09RevD.01
frameworkgroup: C1[X(C20H26N2O)]
method: RPBEPBE
basis: SDD
operation: Freq
keyword: #p
keyword: freq=noraman
keyword: PBEPBE/SDD
title: #p freq=noraman PBEPBE/SDD
converged: YES YES NO NO
title: Mulliken charges:
elementType: O N N C C C C C C C C C C C C C C C C C C C C H H H H H H H H H H H H H H H H H H H H H H H H H H
charge: -0.272579 -0.077577 -0.495568 -0.287963 -0.185404 -0.111218 0.025789 -0.505707 -0.520069 -0.378191 0.236257 -0.426903 -0.435178 0.168777 -0.549630 0.179842 -0.713352 0.185201 -0.593378 -0.343798 0.303633 -0.356078 -0.536611 0.250731 0.199900 0.211409 0.182695 0.235777 0.207686 0.214356 0.214333 0.186038 0.201966 0.210679 0.209309 0.232315 0.191651 0.208128 0.209350 0.293786 0.220383 0.205901 0.217012 0.240058 0.228585 0.244953 0.216185 0.216317 0.240202
chargesum: 0.00000
title: Mulliken charges with hydrogens summed into heavy atoms:
elementType: O N N C C C C C C C C C C C C C C C C C C C C
charge: -0.272579 -0.077577 -0.201783 -0.037232 0.014496 0.100191 0.208484 -0.062243 -0.091380 0.009813 0.236257 -0.006915 -0.011212 0.168777 -0.132152 0.179842 -0.070055 0.185201 -0.353320 -0.115213 0.303633 -0.111125 0.136093
polarizability: 3.31879641e+02 -5.79098523e+00 2.13663822e+02 8.99040581e+00 2.14099051e+00 1.55551203e+02
1716.lowfreq: -10.6013 -0.0008 -0.0003 0.0002 5.2456 16.9857 27.7203 40.3923 66.6596
frequency: 27.4145 40.3101 66.6268 78.3230 101.0298 109.0621 129.7902 140.4932 188.6662 188.8999 217.8809 229.1518 239.3292 246.8222 268.5277 293.3455 309.9856 331.3499 347.7104 380.5677 386.2648 406.4177 412.5592 427.1882 441.7729 455.5941 481.4706 489.1079 498.4606 531.8199 570.4467 618.5759 632.1164 650.9565 677.7028 690.4150 711.3180 722.6209 750.4067 763.7017 776.1456 799.4429 806.4212 811.3600 840.1769 843.2256 862.4194 890.5098 897.5976 906.0678 922.3330 929.8860 945.8947 964.6487 970.9858 985.3301 993.5621 998.8630 1017.1937 1034.9834 1052.3059 1063.6010 1077.5158 1091.1728 1107.5829 1112.9891 1122.2986 1134.9388 1144.4145 1154.0184 1156.9677 1171.9194 1181.7290 1185.3549 1195.9370 1197.6638 1218.4315 1222.3968 1235.3857 1248.0031 1251.1209 1263.5366 1278.1805 1288.3434 1295.2489 1299.0307 1311.2754 1313.4714 1322.8701 1325.1290 1335.8028 1342.7939 1349.5219 1358.4577 1359.9008 1380.6973 1390.9366 1414.3568 1427.4534 1444.1800 1449.5278 1457.6754 1462.4707 1463.6978 1467.0799 1472.0760 1475.4580 1475.9954 1478.3699 1479.7569 1486.4014 1496.6263 1568.7612 1593.4864 1631.6355 2914.8875 2942.8339 2945.6107 2948.2148 2948.7806 2955.6454 2960.1328 2968.4159 2971.1079 2978.4941 2986.0551 3004.5146 3008.7049 3015.5204 3027.4649 3029.4279 3030.8549 3036.5991 3047.1517 3065.4350 3068.7618 3116.0727 3132.5988 3152.1138 3170.2074 3602.1376
redmass: 3.6712 3.4277 2.8966 2.8905 2.7039 3.2837 3.9747 2.8409 3.3954 2.4183 3.2472 1.3364 1.7221 2.8691 2.2562 3.1832 2.5627 2.6147 2.3486 3.1521 3.3760 4.2082 3.8147 2.6011 2.6820 3.9309 3.5222 3.5892 1.2147 3.5873 3.8073 3.1921 5.5141 3.1294 5.8757 4.6401 3.7377 4.2533 3.3249 1.8011 3.1720 1.5217 1.9946 3.0844 1.8952 2.3602 2.4586 1.6403 3.1997 2.3110 2.4391 1.3293 2.2453 2.6631 2.1788 2.7746 2.2988 2.8447 2.3043 2.4734 1.8391 2.0606 1.7866 1.7528 2.0303 1.2636 1.4904 2.1803 1.9280 1.6375 1.5586 1.3009 1.4161 1.4421 2.3178 1.4621 1.3950 1.7075 1.4552 1.3139 1.5537 1.2756 1.8478 1.5616 1.9029 1.7384 1.6755 1.3767 1.4463 1.4781 1.6281 1.5441 1.4473 1.5726 1.4462 1.4723 1.2153 3.9913 1.5429 1.8699 1.2180 1.2404 1.0545 1.0948 2.1618 1.0985 1.9379 1.3186 1.3324 1.0576 1.0628 1.0845 7.2387 6.3659 7.1368 1.0569 1.0700 1.0828 1.0335 1.0983 1.0815 1.0653 1.0531 1.0457 1.0622 1.0622 1.0922 1.0852 1.0863 1.0989 1.1008 1.1033 1.1018 1.1036 1.0996 1.0991 1.0986 1.0894 1.0905 1.0952 1.0802
irintensity: 0.1889 0.7269 0.3885 1.4746 4.0004 0.3939 0.5038 3.1149 1.8986 0.3239 0.8755 0.1826 0.6510 4.2142 0.3113 0.5394 1.9279 2.1190 1.5058 0.8983 0.5784 0.7613 3.2259 5.9573 4.6983 5.7494 1.9528 4.9586 74.9289 12.0650 4.3523 14.3258 0.9939 1.9062 1.3425 1.1630 0.6010 10.6670 1.2494 4.7091 8.5240 48.5105 3.4700 21.2889 21.6511 9.5950 0.8009 5.5933 12.6442 4.1983 3.0174 0.0076 8.3789 5.3902 14.1555 6.9646 6.9199 32.8834 4.6640 3.4572 2.1908 2.7285 3.1511 10.1706 38.4225 0.2480 3.2879 10.0438 64.4715 23.6292 4.6803 20.1106 1.7480 19.5294 108.5196 4.8485 12.6937 11.9885 5.1622 2.4041 17.6379 9.3336 0.2004 4.1611 2.4455 19.3160 23.2386 5.7407 8.7233 0.5456 0.4505 1.6590 6.8688 8.8077 2.5868 2.2001 14.6914 65.9199 12.6104 37.7287 7.9960 0.9413 12.6157 6.9633 44.9852 11.5192 62.3353 68.9383 2.9818 6.9279 10.2589 6.2516 1.4811 46.7156 55.4566 80.8862 38.7395 3.0951 64.5759 75.9768 65.6092 55.3026 41.9784 24.9695 59.5919 31.1477 47.1153 88.0532 31.5665 3.5893 43.6111 62.0523 27.4320 51.2347 70.1711 54.4405 35.3547 13.6699 10.0035 9.8242 39.5498
temp: 298.150 k
press: 1.00000 atm
elementType: 8 7 7 6 6 6 6 6 6 6 6 6 6 6 6 6 6 6 6 6 6 6 6 1 1 1 1 1 1 1 1 1 1 1 1 1 1 1 1 1 1 1 1 1 1 1 1 1 1
symmnumber: 1
zpe: 1105139.8 jmol-1
zpe.correction: 0.420926 hartree
zpe.thermalcorrener: 0.441076 hartree
zpe.thermalcorrenthalpy: 0.442020 hartree
zpe.thermalcorrgfe: 0.372920 hartree
zpe.sumelectzpe: -960.728681 hartree
zpe.sumelectthermal: -960.708530 hartree
zpe.sumelectthermalent: -960.707586 hartree
zpe.sumelectthermalfe: -960.776686 hartree
dipole: 2.1613 -0.2657 0.8007
dipole: 2.3201
quadrupole: -147.4443 -121.4581 -140.2771
quadrupole: -11.4391 2.2786 1.4006
quadrupole: -11.0512 14.9351 -3.8839 -11.4391 2.2786 1.4006
hfenergy: -961.1496063 hartree
pointgroup: C01 [X(C20H26N2O1)]
dipole: -0.8496892 -0.1206906 -0.3108793 debye
polarizability: 331.6432713|8.5513276|214.0655123|7.926694|-1.096426|155.3858821 unknown
InChI: InChI=1S/C20H26N2O/c1-3-13-8-12-9-17-19-15(6-7-22(11-12)20(13)17)16-10-14(23-2)4-5-18(16)21-19/h4-5,10,12-13,17,20-21H,3,6-9,11H2,1-2H3
charge 0 multiplicity 1
49 atoms
O  5.84535 0.670227 0.279537
N  -2.272068 1.312362 0.130438
N  0.894225 -1.89286 -0.044543
C  -2.327605 -0.092569 0.603514
C  -1.475536 -1.050144 -0.299317
C  -3.218924 0.084723 -1.796064
C  -3.806823 -0.580615 0.593229
C  -2.005658 -0.883136 -1.779183
C  -4.345718 -0.450319 -0.875868
C  -2.760585 1.467918 -1.268557
C  0.007797 -0.803974 -0.153187
C  -1.083646 2.101938 0.506286
C  -4.669591 0.179316 1.628112
C  0.754773 0.38583 -0.129695
C  0.238203 1.801902 -0.264136
C  2.151209 0.006138 -0.00475
C  -6.103483 -0.378104 1.762612
C  2.210636 -1.428463 0.052205
C  3.358113 0.7586 0.067593
C  3.432236 -2.124442 0.185649
C  4.574424 0.057679 0.197935
C  4.614802 -1.369448 0.25806
C  5.885433 2.128839 0.222146
H  -1.933871 -0.115247 1.637669
H  -1.679636 -2.089702 0.035319
H  -3.593716 0.198008 -2.831731
H  -3.796652 -1.652914 0.884818
H  -1.202039 -0.484212 -2.425945
H  -2.302077 -1.863734 -2.197104
H  -5.201339 0.252086 -0.907452
H  -4.716128 -1.421347 -1.256051
H  -1.962474 1.860831 -1.936374
H  -3.60384 2.191504 -1.313026
H  -0.908036 1.944298 1.588158
H  -1.327519 3.175622 0.367999
H  -4.69198 1.250084 1.347894
H  -4.1692 0.129611 2.617423
H  1.006519 2.507563 0.110825
H  0.098442 2.060473 -1.336112
H  0.604286 -2.868023 -0.014475
H  -6.650957 -0.329329 0.802837
H  -6.091854 -1.43637 2.087678
H  -6.686046 0.1959 2.50671
H  3.329892 1.851311 0.019605
H  3.471177 -3.218501 0.231041
H  5.591848 -1.850775 0.36073
H  5.326329 2.583845 1.064433
H  5.476081 2.508736 -0.735577
H  6.950525 2.394381 0.299688
