program: Gaussian 09
title: 000197010
version: EM64L-G09RevD.01
frameworkgroup: C1[X(C8H7ClO)]
method: RPBEPBE
basis: SDD
operation: Freq
keyword: #p
keyword: freq=noraman
keyword: PBEPBE/SDD
title: #p freq=noraman PBEPBE/SDD
converged: YES YES NO NO
title: Mulliken charges:
elementType: Cl O C C C C C C C C H H H H H H H
charge: -0.057003 -0.300749 -0.207625 -0.352528 0.467397 -0.356046 -0.391752 -0.209234 -0.209045 -0.102242 0.237759 0.229707 0.231101 0.269504 0.237657 0.256433 0.256666
chargesum: 0.00000
title: Mulliken charges with hydrogens summed into heavy atoms:
elementType: Cl O C C C C C C C C
charge: -0.057003 -0.300749 0.030134 0.108281 0.467397 -0.086541 -0.154095 0.047198 0.047621 -0.102242
polarizability: 1.46601070e+02 4.27797631e-01 8.90017655e+01 2.36698191e+00 -1.26350470e+00 4.85692773e+01
1716.lowfreq: -8.4298 -5.6967 -0.0011 0.0006 0.0012 7.7751 53.0390 90.8373 147.8599
frequency: 53.0365 90.8352 147.8596 215.0008 267.4305 326.8719 388.8101 409.2405 453.1922 525.4278 612.6101 627.1321 713.8856 737.2193 758.9385 816.7235 829.9991 840.8133 945.5017 967.1940 972.2842 999.9775 1018.8634 1071.0343 1092.6425 1104.0994 1111.5619 1179.8241 1186.4182 1241.3607 1291.9882 1347.2701 1386.4035 1404.5799 1470.6063 1481.3015 1586.2904 1604.6506 3060.4392 3092.0713 3129.7169 3147.7559 3170.2375 3171.5956 3173.1531
redmass: 4.5696 4.3974 7.2037 4.6796 7.7228 6.7427 4.2945 2.9287 6.8119 2.8282 4.5420 5.7894 3.7508 6.0919 3.8784 2.2802 1.8130 1.5357 1.3330 1.5290 1.3648 3.8591 1.1760 2.7673 1.4121 1.3050 1.3075 1.1197 2.8308 1.4742 1.3125 3.2923 5.2768 2.2567 1.1728 2.6291 7.4356 6.2179 1.0521 1.0905 1.0899 1.0887 1.0956 1.1196 1.0967
irintensity: 3.1011 3.0596 3.3112 2.8980 1.0979 3.9568 2.4677 0.2624 19.6823 26.8868 3.2165 2.2206 1.4395 2.3354 42.1719 68.1118 3.1981 18.9883 4.3620 21.9751 2.2996 25.7364 2.4090 35.3058 1.6811 2.8526 17.6691 0.2585 3.4463 1.2586 3.1288 11.3758 2.2213 8.2905 6.0000 65.5250 1.9915 9.2552 29.9328 18.2250 11.4924 0.7873 5.5320 31.1958 0.5277
temp: 298.150 k
press: 1.00000 atm
elementType: 17 8 6 6 6 6 6 6 6 6 1 1 1 1 1 1 1
symmnumber: 1
zpe: 330312.0 jmol-1
zpe.correction: 0.125809 hartree
zpe.thermalcorrener: 0.134557 hartree
zpe.thermalcorrenthalpy: 0.135501 hartree
zpe.thermalcorrgfe: 0.091005 hartree
zpe.sumelectzpe: -843.565797 hartree
zpe.sumelectthermal: -843.557049 hartree
zpe.sumelectthermalent: -843.556105 hartree
zpe.sumelectthermalfe: -843.600600 hartree
dipole: 1.3956 1.5812 1.6385
dipole: 2.6707
quadrupole: -70.3222 -57.7585 -67.9456
quadrupole: 4.2396 6.8165 -1.9146
quadrupole: -4.9801 7.5836 -2.6035 4.2396 6.8165 -1.9146
hfenergy: -843.6916058 hartree
pointgroup: C01 [X(C8H7Cl1O1)]
dipole: 0.5446477 -0.7526575 -0.4907929 debye
dipolederiv: -0.8797988 0.0920027 -0.061205 0.1034465 -0.1393395 0.0185361 -0.0767943 0.0196465 -0.0796691 -0.5672495 -0.0383895 -0.0762864 -0.1683269 -0.4444752 -0.1480546 -0.2392322 -0.1421019 -0.39995 0.4072309 -0.0327655 0.0372876 -0.0305878 0.259073 -0.0667318 0.3099636 -0.0014495 0.2165028 0.1824771 -0.0988817 0.0612317 -0.0147283 0.1718448 0.0700838 -0.0146566 0.0006787 0.2474887 0.1989055 0.0133447 -0.0407089 -0.034871 -0.1163203 0.0324053 -0.0776065 0.0272702 -0.0642472 -0.0438258 0.0388266 0.0152786 0.033581 0.033117 -0.0401448 0.0551501 -0.0076417 -0.1260822 -0.048271 -0.0491897 0.0328791 0.0083697 0.0872102 -0.0456537 -0.0069122 -0.0513731 -0.1384752 -0.3173696 -0.0290282 -0.0060734 -0.0448734 0.0275302 -0.0200443 -0.0112035 -0.022888 -0.1012257 -0.2751308 0.1037368 -0.026551 0.1354919 -0.0304343 -0.008104 -0.0287315 -0.0048686 -0.1036682 1.2310812 -0.1431639 0.1145359 -0.1538847 0.1234161 -0.047543 0.1244498 -0.0503876 -0.0543169 -0.0176484 -0.0083445 -0.0076201 0.0408902 -0.0657729 0.0957806 -0.044269 0.0950105 0.0483605 -0.1350854 0.1025852 0.0572504 0.0795193 0.0572064 -0.0386675 0.0633331 -0.0156454 0.0314814 0.0720744 0.0695465 -0.06826 0.0600592 0.0522894 0.0658835 -0.0191214 0.0355967 -0.0813013 0.0583028 -0.0802449 0.0061463 -0.0632603 0.0294509 0.0273206 0.0078463 0.0124741 0.1453827 0.0423272 0.0842274 -0.0292267 0.0681989 -0.0532025 0.045702 -0.0247495 0.0486087 0.1414407 0.0659712 0.0546524 -0.0161126 0.0526563 -0.0133546 0.034747 -0.0219054 0.0333588 0.1566726 0.0260093 -0.0789143 0.0074346 -0.0716806 0.0217615 0.0244847 0.0044393 0.0237118 0.1616065 unknown
polarizability: 146.5676387|-2.2370906|87.0047145|0.6036793|-9.0542832|50.5997597 unknown
InChI: InChI=1S/C8H7ClO/c9-7-3-1-6(2-4-7)8-5-10-8/h1-4,8H,5H2
charge 0 multiplicity 1
17 atoms
Cl -3.908675 0.321809 -0.238679
O  2.995509 0.67543 0.583958
C  2.13605 -0.544397 0.33118
C  3.1045 -0.067619 -0.720084
C  0.663345 -0.317296 0.210515
C  0.143117 0.972339 -0.06796
C  -0.232838 -1.404366 0.367602
C  -1.246543 1.17388 -0.205853
C  -1.626295 -1.220411 0.228057
C  -2.110179 0.069689 -0.061335
H  2.436407 -1.417126 0.926879
H  4.049292 -0.604651 -0.870245
H  2.708266 0.468952 -1.591569
H  0.833757 1.819287 -0.142454
H  0.153069 -2.404676 0.597787
H  -1.651222 2.168799 -0.412673
H  -2.318258 -2.058941 0.346873
