program: Gaussian 09
title: 000197025
version: EM64L-G09RevD.01
frameworkgroup: C1[X(C10H15Cl2NS)]
method: RPBEPBE
basis: SDD
operation: Freq
keyword: #p
keyword: freq=noraman
keyword: PBEPBE/SDD
title: #p freq=noraman PBEPBE/SDD
converged: YES YES NO NO
title: Mulliken charges:
elementType: Cl Cl S N C C C C C C C C C C H H H H H H H H H H H H H H H
charge: -0.072767 -0.073272 0.174802 -0.122833 -0.418019 -0.324592 -0.327160 -0.095610 -0.582262 -0.572851 -0.272549 -0.016451 -0.261626 -0.754797 0.238290 0.220237 0.256688 0.232171 0.235064 0.234904 0.279533 0.260802 0.268180 0.267061 0.260726 0.249955 0.239039 0.237505 0.239831
chargesum: 0.00000
title: Mulliken charges with hydrogens summed into heavy atoms:
elementType: Cl Cl S N C C C C C C C C C C
charge: -0.072767 -0.073272 0.174802 -0.122833 0.040507 0.164268 0.142808 -0.095610 -0.041927 -0.037610 -0.011823 -0.016451 -0.011671 -0.038422
polarizability: 1.97320648e+02 -8.62476393e+00 1.31951464e+02 -2.44343764e+00 5.77076332e+00 1.24367183e+02
1716.lowfreq: -5.7199 0.0015 0.0019 0.0024 2.8656 3.6093 19.4894 29.3151 32.9751
frequency: 19.3902 29.1766 32.9240 40.9190 76.6399 89.1125 99.0389 109.0787 134.3213 162.7765 196.1685 204.5960 255.4687 273.9823 289.4939 329.1998 358.5152 419.5734 452.6557 479.7147 525.9597 561.2104 611.4898 662.8081 668.5488 703.8423 739.2850 771.4970 777.6341 816.8077 830.5301 895.8953 948.8468 968.3632 993.4902 1001.4984 1036.2069 1041.6241 1061.2934 1064.1981 1084.7733 1109.7319 1133.8503 1161.6305 1181.6729 1221.6137 1230.7990 1247.0075 1253.5221 1271.9957 1289.0185 1304.1747 1321.0888 1361.5251 1367.3925 1380.7848 1400.7962 1449.3424 1453.0701 1459.5175 1468.1312 1470.2298 1471.7154 1478.5270 1538.5089 1580.4539 2878.1953 2940.4021 2944.5008 2976.7031 2993.8829 3053.1453 3054.3023 3055.9167 3060.5550 3067.8038 3085.2670 3146.6264 3147.6213 3163.3827 3184.4425
redmass: 6.0486 5.6661 9.4933 5.6135 2.3600 3.0410 3.1382 1.0997 4.3019 3.1822 4.6896 5.2987 3.8869 2.8862 3.7567 3.0828 4.0441 4.1339 3.5230 4.2346 5.7328 3.0529 5.7408 6.6938 6.2045 6.4805 4.2855 1.1538 1.1510 1.2628 4.0417 1.3888 1.9637 1.7052 1.6809 1.4262 1.3735 1.4070 3.4462 2.6797 1.8679 1.8229 2.1194 3.5034 1.5262 1.4303 1.5560 1.1588 1.3095 1.3033 1.3859 1.2954 2.2467 1.3238 1.3715 1.3931 1.2269 1.0929 1.0951 1.0435 1.0923 1.0986 1.0888 1.0852 6.2939 5.5830 1.0705 1.0685 1.0687 1.0365 1.0875 1.0915 1.0983 1.0615 1.0594 1.0888 1.0984 1.1118 1.1116 1.0910 1.0991
irintensity: 0.1385 0.4918 0.9471 0.5152 2.1250 1.6418 3.3685 0.0479 3.3558 1.7696 8.6893 1.7941 1.5932 1.6967 0.5205 0.4284 14.6383 2.1949 7.8675 16.7107 0.1497 1.2616 3.2699 69.4435 107.3892 9.1313 7.1445 4.7830 10.5373 51.4892 14.2608 2.7593 13.7325 4.1502 27.1764 5.6666 13.4566 5.1426 8.6370 11.4116 32.2596 45.1688 0.5420 8.2853 7.9107 26.5837 26.1364 10.2862 18.7829 11.4594 12.7755 13.9840 5.6808 0.7016 11.4191 8.7580 6.9350 5.7846 6.2513 16.5626 13.1224 10.8308 9.7618 11.8302 12.6949 1.8655 61.4655 18.4527 76.6103 39.2541 22.9546 11.0392 18.2482 13.6861 22.4736 14.0414 14.1658 13.8632 20.8327 11.3366 4.8635
temp: 298.150 k
press: 1.00000 atm
elementType: 17 17 16 7 6 6 6 6 6 6 6 6 6 6 1 1 1 1 1 1 1 1 1 1 1 1 1 1 1
symmnumber: 1
zpe: 605175.2 jmol-1
zpe.correction: 0.230499 hartree
zpe.thermalcorrener: 0.247086 hartree
zpe.thermalcorrenthalpy: 0.248030 hartree
zpe.thermalcorrgfe: 0.182048 hartree
zpe.sumelectzpe: -1761.876800 hartree
zpe.sumelectthermal: -1761.860214 hartree
zpe.sumelectthermalent: -1761.859270 hartree
zpe.sumelectthermalfe: -1761.925252 hartree
dipole: -2.6799 -1.2426 0.2270
dipole: 2.9626
quadrupole: -107.8009 -123.3879 -101.7350
quadrupole: 4.3834 -4.2690 1.5000
quadrupole: 3.1737 -12.4133 9.2396 4.3834 -4.2690 1.5000
hfenergy: -1762.1072995 hartree
pointgroup: C01 [X(C10H15Cl2N1S1)]
dipole: 1.0845593 -0.4260122 0.029087 debye
polarizability: 195.8509117|13.0248477|132.8215992|4.241455|-5.0006649|124.9667831 unknown
InChI: InChI=1S/C10H15Cl2NS/c1-9-2-3-10(14-9)8-13(6-4-11)7-5-12/h2-3H,4-8H2,1H3
charge 0 multiplicity 1
29 atoms
Cl -1.681675 4.036146 -0.276794
Cl -4.610934 -2.422753 -0.637258
S  2.550641 -0.614609 1.427963
N  -1.372121 -0.044358 0.395734
C  -0.29165 -0.845319 1.019541
C  -1.311693 1.411743 0.657227
C  -2.715105 -0.660621 0.467157
C  1.059346 -0.567881 0.399923
C  -1.646734 2.174836 -0.631078
C  -2.928881 -1.555812 -0.762049
C  1.389498 -0.311677 -0.920628
C  3.594421 -0.280729 -0.019563
C  2.806494 -0.149521 -1.152803
C  5.08689 -0.181259 0.12934
H  -0.549569 -1.913969 0.879744
H  -0.23956 -0.68307 2.12388
H  -0.286449 1.675542 0.968917
H  -2.001056 1.725706 1.471756
H  -3.485597 0.130825 0.476337
H  -2.858221 -1.257214 1.394553
H  -0.878718 2.024482 -1.402614
H  -2.6475 1.93549 -1.02177
H  -2.953986 -0.974273 -1.694706
H  -2.18549 -2.364199 -0.831913
H  0.629529 -0.241108 -1.702306
H  3.234064 0.060812 -2.136855
H  5.528228 -1.117651 0.519045
H  5.545869 0.023047 -0.853572
H  5.382263 0.634694 0.815289
