program: Gaussian 09
title: 000189193
version: EM64L-G09RevD.01
frameworkgroup: C1[X(C2H5N3O2)]
method: RPBEPBE
basis: SDD
operation: Freq
keyword: #pfreq=noraman
keyword: PBEPBE/SDD
title: #p freq=noraman PBEPBE/SDD
converged: YES YES NO NO
title: Mulliken charges:
elementType: O O N N N C C H H H H H
charge: -0.329328 -0.260691 -0.639257 -0.636192 0.123198 0.418023 -0.271918 0.250516 0.334955 0.322427 0.308913 0.379353
chargesum: 0.00000
title: Mulliken charges with hydrogens summed into heavy atoms:
elementType: O O N N N C C
charge: -0.329328 -0.260691 0.018126 0.052075 0.123198 0.418023 -0.021402
polarizability: 9.17472114e+01 4.08517974e+00 6.07108814e+01 1.19096662e-02 4.28795971e-02 2.23558305e+01
1716.lowfreq: -11.6436 -5.0086 -0.0006 -0.0003 0.0007 5.6582 122.2031 130.5718 230.5063
frequency: 122.1987 130.5675 230.5061 268.2974 398.2707 404.1604 431.8313 465.8068 549.8351 636.3474 662.2708 693.9231 727.9168 839.6723 921.0266 985.7456 1038.7466 1111.9373 1227.2159 1274.2521 1379.4472 1509.5986 1555.8917 1625.9831 1650.4162 3191.3779 3217.9677 3566.0532 3629.0624 3706.3400
redmass: 2.0861 7.8258 1.4042 4.5040 6.1185 3.7328 1.2433 1.1585 3.7690 2.4645 3.0895 8.1688 2.6826 1.1003 5.7162 3.4244 1.3772 1.5483 4.7520 2.5348 2.9377 1.5414 3.2690 2.4550 1.3741 1.0660 1.0924 1.0460 1.0875 1.1045
irintensity: 1.4500 0.2309 9.1953 7.1520 1.8298 5.7275 327.8670 108.9681 3.6143 32.7901 21.4494 2.3860 77.2704 156.2927 12.5721 52.4312 8.1090 5.0167 102.3840 233.5246 150.2867 3.1424 257.5052 360.3845 374.6705 123.2322 5.3805 89.8013 66.4369 37.1206
temp: 298.150 k
press: 1.00000 atm
elementType: 8 8 7 7 7 6 6 1 1 1 1 1
symmnumber: 1
zpe: 228203.6 jmol-1
zpe.correction: 0.086918 hartree
zpe.thermalcorrener: 0.094182 hartree
zpe.thermalcorrenthalpy: 0.095126 hartree
zpe.thermalcorrgfe: 0.055752 hartree
zpe.sumelectzpe: -393.291995 hartree
zpe.sumelectthermal: -393.284731 hartree
zpe.sumelectthermalent: -393.283787 hartree
zpe.sumelectthermalfe: -393.323161 hartree
dipole: 8.9516 -0.7517 0.0115
dipole: 8.9831
quadrupole: -38.4950 -35.7134 -43.5198
quadrupole: -0.1418 0.0674 -0.1147
quadrupole: 0.7477 3.5293 -4.2771 -0.1418 0.0674 -0.1147
hfenergy: -393.3789135 hartree
pointgroup: C01 [X(C2H5N3O2)]
dipole: 3.5287899 0.1466451 0.1304327 debye
dipolederiv: -0.5678218 0.0423317 0.0038406 0.2731907 -0.9222896 -0.1194028 0.0498242 -0.1282476 -0.3506882 -0.9716304 -0.2952524 -0.0836094 -0.3942561 -0.6356335 -0.0880686 -0.1036384 -0.0858321 -0.3004381 -1.3624359 0.3204534 0.0723625 0.3463008 -0.3738216 0.0942091 0.1008692 0.0891196 -0.6883712 -0.4947778 -0.0635545 -0.0224881 -0.2807987 -1.0635763 -0.1106515 -0.0766525 -0.1183891 -0.6715922 1.8713151 0.1336392 0.0777413 -0.2263583 1.1135039 0.1861006 0.0022277 0.1982375 0.2603913 1.9883795 -0.0998558 0.0127108 0.4784653 1.1810382 0.2077935 0.1381839 0.1902979 0.3475289 -1.466943 -0.1142581 -0.0544401 -0.1662512 -0.1974744 0.0288975 -0.0682642 0.0335146 -0.363794 0.0322368 0.0272336 -0.0004843 0.0446449 0.0158096 -0.045882 0.0002154 -0.047157 0.2349369 0.2134787 -0.0446944 -0.0186785 -0.0813877 0.1961453 -0.0489674 -0.0276833 -0.0449626 0.3912009 0.2420612 -0.0191611 -0.0124307 0.0079145 0.1522433 -0.059474 -0.0272659 -0.059023 0.3784613 0.122733 -0.0237621 -0.0050443 -0.0014345 0.2558657 -0.0269904 0.0093448 -0.0180545 0.3884352 0.3934048 0.1368805 0.0305201 -0.0000297 0.2781893 -0.0175642 0.0028392 -0.0095037 0.3739293 unknown
polarizability: 90.0950128|7.4392637|60.4382636|3.4187746|8.4563655|24.2806468 unknown
InChI: InChI=1S/C2H5N3O2/c3-2(4)1-5(6)7/h1H,3-4H2
charge 0 multiplicity 1
12 atoms
O  -1.492676 1.037257 0.155277
O  -2.246512 -1.079373 -0.322033
N  2.445678 -0.492014 -0.074751
N  1.088041 1.407826 0.309947
N  -1.266634 -0.250559 -0.115072
C  1.18894 0.076936 0.022194
C  0.049693 -0.734727 -0.178264
H  0.1333 -1.797757 -0.396748
H  2.540062 -1.479262 -0.295164
H  3.290049 0.044461 0.104651
H  1.899774 2.009572 0.427336
H  0.105187 1.748739 0.359627
