program: Gaussian 09
title: 000189192
version: EM64L-G09RevD.01
frameworkgroup: C1[X(C10H18N2O4S)]
method: RPBEPBE
basis: SDD
operation: Freq
keyword: #p
keyword: freq=noraman
keyword: PBEPBE/SDD
title: #p freq=noraman PBEPBE/SDD
converged: YES YES NO NO
title: Mulliken charges:
elementType: S O O O O N N C C C C C C C C C C H H H H H H H H H H H H H H H H H H
charge: -0.018968 -0.293183 -0.256654 -0.202385 -0.284252 -0.365764 -0.378233 -0.338669 -0.393910 -0.346907 -0.121804 -0.725616 -0.682002 0.224087 0.260484 0.265387 -0.772367 0.204232 0.224747 0.218466 0.252507 0.206692 0.192423 0.298557 0.323276 0.290369 0.381470 0.214353 0.220192 0.209322 0.355110 0.253930 0.254312 0.221906 0.108893
chargesum: 0.00000
title: Mulliken charges with hydrogens summed into heavy atoms:
elementType: S O O O O N N C C C C C C C C C C
charge: 0.089925 -0.293183 -0.256654 -0.202385 -0.284252 0.015706 -0.023122 0.090310 0.077063 0.052208 0.176753 -0.111971 -0.038135 0.224087 0.260484 0.265387 -0.042220
polarizability: 1.80975206e+02 1.47849294e+01 1.36226369e+02 5.19508782e+00 -4.65981352e+00 1.40214398e+02
1716.lowfreq: -0.0024 -0.0010 -0.0010 2.9675 5.2416 6.9818 14.3636 23.0266 34.4231
frequency: 12.1909 22.9409 34.2637 42.5086 46.2773 62.0190 63.8294 68.6764 81.7244 100.6938 114.8776 160.5307 164.0507 191.6981 198.3927 219.5905 227.7008 240.3083 283.5634 292.5319 339.9532 365.5175 410.2999 433.6678 489.0930 521.7260 532.0017 568.5970 604.9121 613.2500 630.3670 662.9807 676.3813 731.8580 741.8096 759.4696 777.3620 781.3486 835.5032 848.5971 859.0576 937.4225 939.8012 951.7668 970.0104 994.0816 1005.6770 1037.7185 1044.5545 1072.9708 1120.0566 1129.5149 1140.6489 1148.2773 1187.5022 1205.2729 1233.5639 1235.1530 1262.2111 1270.6075 1292.6077 1301.5441 1317.6083 1322.1960 1350.5190 1366.1728 1390.4541 1392.7837 1427.9337 1450.2396 1459.6500 1460.9084 1462.3015 1474.0368 1478.1670 1480.9916 1486.0010 1512.9361 1604.5551 1613.2449 1772.3099 2430.5752 2963.2371 2965.9422 2976.9130 2981.7650 3000.2147 3007.7788 3013.6306 3046.1264 3060.1997 3073.5445 3078.1702 3080.4258 3098.6702 3106.3229 3141.1541 3368.5219 3565.2378
redmass: 4.3656 4.9370 10.1637 3.4256 4.6376 1.3521 2.7537 2.2654 3.8307 6.7533 4.3382 3.1573 4.8924 3.9686 4.2770 1.3199 1.3160 2.7147 2.4575 2.6974 3.6153 6.1832 5.0125 3.8510 3.7434 3.0035 4.4109 1.5251 2.5397 4.9616 4.8000 3.7349 8.4689 1.4667 2.7480 2.9966 1.2493 1.2404 2.1134 1.9426 3.8824 2.5810 1.6552 3.8320 1.6783 1.7793 1.7522 3.6119 1.6541 2.4260 2.0430 2.9784 2.3469 2.4614 1.5436 2.1121 1.3243 1.3357 1.7524 1.2873 1.1046 1.6629 1.2119 1.3511 1.3602 1.4192 1.2297 1.2113 1.0836 1.0467 1.0777 1.1052 1.2060 1.0652 1.0427 1.7717 1.0808 1.6200 6.4642 6.3977 9.7406 1.0384 1.0801 1.0596 1.0366 1.0600 1.0359 1.0788 1.0823 1.1005 1.0581 1.1008 1.0997 1.1043 1.0979 1.1011 1.1080 1.0820 1.0787
irintensity: 0.0428 0.2431 1.6049 2.2071 0.0875 1.0814 10.3495 7.4881 4.2290 1.7282 1.2977 0.5512 5.5827 11.6991 0.9525 30.2406 0.5859 7.8208 5.4192 2.3639 5.1336 14.6034 2.4556 11.1642 3.0172 0.5141 25.3861 109.5719 16.1029 7.4472 10.9034 12.3205 16.5525 17.4352 163.3730 30.0097 2.0347 120.5201 61.8981 33.9939 52.3283 10.2453 59.3906 23.7509 8.6402 53.3965 117.8141 12.2253 13.0586 34.0048 10.0358 253.3499 6.5706 83.1075 6.1228 17.4231 1.9873 7.7444 46.7337 7.9683 0.1147 47.9642 7.2273 9.7801 6.3290 5.7876 69.2350 10.1386 26.7881 16.5625 4.1320 53.0751 165.1352 15.2928 9.4052 315.4805 18.5515 254.2272 164.6544 42.2529 350.2650 25.0311 25.3788 23.8844 27.3399 44.8120 7.1920 21.1024 5.8067 42.1079 7.5243 74.0192 33.2222 28.5894 7.9884 16.4504 1.1514 191.8116 59.9953
temp: 298.150 k
press: 1.00000 atm
elementType: 16 8 8 8 8 7 7 6 6 6 6 6 6 6 6 6 6 1 1 1 1 1 1 1 1 1 1 1 1 1 1 1 1 1 1
symmnumber: 1
zpe: 730167.8 jmol-1
zpe.correction: 0.278106 hartree
zpe.thermalcorrener: 0.298869 hartree
zpe.thermalcorrenthalpy: 0.299813 hartree
zpe.thermalcorrgfe: 0.223957 hartree
zpe.sumelectzpe: -1199.011196 hartree
zpe.sumelectthermal: -1198.990433 hartree
zpe.sumelectthermalent: -1198.989489 hartree
zpe.sumelectthermalfe: -1199.065345 hartree
dipole: 4.0981 1.1263 0.1222
dipole: 4.2518
quadrupole: -108.1718 -110.1241 -119.1830
quadrupole: 6.7261 -9.7607 -1.7318
quadrupole: 4.3211 2.3689 -6.6900 6.7261 -9.7607 -1.7318
hfenergy: -1199.2893019 hartree
pointgroup: C01[X(C10H18N2O4S1)]
dipole: 1.6406311 -0.1494706 0.2901291 debye
polarizability: 183.4848567|-8.1658593|131.4542163|7.0799008|3.4739711|142.4769008 unknown
InChI: InChI=1S/C10H18N2O4S/c1-3-4-5-11-10(15)16-9(14)8(6-17)12-7(2)13/h8,11-12,17H,3-6H2,1-2H3
charge 0 multiplicity 1
35 atoms
S  -2.597988 -3.019674 1.876756
O  -0.060649 -1.034362 -0.330193
O  0.190011 -0.568494 1.959207
O  1.550427 -1.699058 -1.877191
O  -4.376428 0.871932 0.122755
N  2.22761 -1.352101 0.35268
N  -2.633696 -0.563856 -0.383599
C  4.495637 -0.400954 -0.229113
C  3.665223 -1.647956 0.152613
C  4.533996 0.686151 0.86838
C  -2.018347 -0.350142 0.924352
C  -2.71714 -1.140345 2.066386
C  5.380315 1.910076 0.457141
C  -0.521428 -0.648574 0.924671
C  1.360417 -1.398397 -0.690806
C  -3.808211 0.094274 -0.708464
C  -4.361651 -0.175519 -2.100333
H  5.528745 -0.738154 -0.449695
H  4.095006 0.023583 -1.170309
H  4.043392 -2.08598 1.094895
H  3.746152 -2.412743 -0.639382
H  3.50132 1.016158 1.099811
H  4.942818 0.249445 1.802963
H  -2.148911 0.723087 1.18461
H  -3.790559 -0.900621 2.04085
H  -2.298392 -0.853686 3.042897
H  1.863667 -1.058097 1.271974
H  4.972629 2.384508 -0.45499
H  5.398444 2.673363 1.255935
H  6.425758 1.617496 0.244438
H  -2.150774 -1.166652 -1.051573
H  -5.359946 -0.637864 -2.010275
H  -4.49363 0.785099 -2.626838
H  -3.717297 -0.833118 -2.707899
H  -1.359722 -3.15403 2.486547
