program: Gaussian 09
title: 000197145
version: EM64L-G09RevD.01
frameworkgroup: C1[X(C21H30O2)]
method: RPBEPBE
basis: SDD
operation: Freq
keyword: #pfreq=noraman
keyword: PBEPBE/SDD
title: #p freq=noraman PBEPBE/SDD
converged: YES YES NO NO
title: Mulliken charges:
elementType: O O C C C C C C C C C C C C C C C C C C C C C H H H H H H H H H H H H H H H H H H H H H H H H H H H H H H
charge: -0.464993 -0.200745 -0.128125 -0.112425 -0.164232 0.348980 0.409685 -0.055056 -0.538537 -0.526550 -0.505618 0.044196 -0.547277 -0.475214 -0.494562 -0.513467 -0.834919 -0.864607 -0.598883 -0.544325 0.176735 0.240220 -0.552606 0.233226 0.196336 0.267931 0.211758 0.214636 0.213594 0.249211 0.207322 0.216872 0.205447 0.219757 0.232529 0.199461 0.204420 0.237474 0.214217 0.221333 0.221170 0.229353 0.230483 0.238914 0.220886 0.227841 0.225515 0.224596 0.238897 0.242441 0.227717 0.342472 0.286513
chargesum: 0.00000
title: Mulliken charges with hydrogens summed into heavy atoms:
elementType: O O C C C C C C C C C C C C C C C C C C C C C
charge: -0.122521 -0.200745 0.105101 0.083911 0.103699 0.348980 0.409685 0.156702 -0.110307 -0.070017 -0.083299 0.044196 -0.094991 -0.071333 -0.042871 -0.070963 -0.136169 -0.190365 -0.135390 -0.074167 0.176735 0.240220 -0.266093
polarizability: 2.83570295e+02 1.22349845e+01 2.02017133e+02 -9.52872673e+00 -3.49146627e+00 1.72139349e+02
1716.lowfreq: -14.6915 -0.0006 -0.0004 0.0003 1.9935 9.4465 35.3658 54.6380 64.9211
frequency: 35.2184 54.5678 64.9021 86.2648 103.4295 123.7829 146.5556 147.3467 177.3944 179.6442 208.1851 215.9233 229.9223 230.8945 244.3730 250.8750 261.4305 279.7362 299.4508 313.8593 335.1423 355.3146 373.5753 387.5675 390.6397 395.8057 417.0007 423.8633 442.1014 449.0878 484.4423 490.9848 497.5052 519.1237 543.5352 558.2041 573.1184 597.8133 630.3254 638.8867 658.2454 669.4772 692.3528 724.9524 761.4519 784.5630 802.6069 806.1234 824.2367 840.3013 864.5751 878.6027 908.8598 912.5171 925.9117 936.7686 950.8138 963.5624 968.1723 989.4453 990.0245 998.0122 1005.7088 1018.5252 1029.4728 1033.6079 1048.1669 1067.7764 1074.7442 1080.3817 1093.6683 1118.7601 1121.0684 1121.9498 1127.1945 1139.6511 1152.2114 1158.1996 1173.6309 1181.2059 1195.2860 1211.8268 1218.1022 1220.4357 1227.3951 1241.1296 1245.9271 1256.7074 1264.2338 1268.2575 1275.9160 1292.0507 1295.8616 1301.3344 1304.4948 1313.1236 1321.6490 1326.4177 1330.5911 1333.4011 1339.8613 1340.9854 1349.4678 1351.2435 1358.1197 1370.3759 1392.7509 1395.0917 1437.7575 1447.6475 1456.7269 1464.8375 1465.7817 1469.7807 1470.5723 1475.2412 1478.5506 1485.7699 1489.2580 1492.5794 1496.2791 1630.8743 2127.3983 2906.5234 2930.9212 2949.1665 2956.4477 2964.9024 2968.2752 2969.9117 2974.0811 2974.9942 2977.4886 2986.4012 2990.0938 2992.4198 2994.2712 3014.1911 3016.7800 3026.8783 3029.5018 3039.6022 3054.7293 3055.1433 3056.8637 3064.6195 3073.4323 3076.4688 3081.2209 3081.6917 3090.8738 3427.0331 3558.6703
redmass: 5.6939 4.0750 5.1581 3.8678 3.0855 1.8331 3.9193 1.7567 2.3565 3.3439 2.6666 1.2950 1.2682 3.0858 2.0407 2.1061 2.4402 2.4452 2.6019 2.8719 2.7583 2.7929 3.0079 2.6901 3.7474 3.4689 2.5120 3.5067 3.4103 2.8325 2.8885 3.7088 2.7943 2.4770 2.8337 2.6434 5.0430 3.8603 1.5088 2.4506 1.2514 3.2733 2.5530 2.4821 2.0131 1.9766 2.2393 2.8572 2.0038 1.9533 2.0793 1.8497 1.7479 2.0455 1.7959 1.8652 1.9661 2.3198 2.2823 2.3115 2.4104 1.9117 2.2595 1.9613 2.0239 2.0123 2.5231 2.0639 2.5091 1.9679 2.1499 1.6264 1.7863 2.2896 1.9962 1.9789 1.9480 1.8991 1.8151 1.6733 2.0252 1.7975 1.4215 1.5542 1.8092 1.3862 1.4340 1.6343 1.5014 1.4735 1.7882 1.4189 1.4093 1.3855 1.3262 1.5719 1.3664 1.4442 1.4209 1.4743 1.3913 1.3909 1.4325 1.5083 1.4061 1.4350 1.2127 1.2064 1.0874 1.0824 1.0731 1.0855 1.0780 1.0858 1.0838 1.0763 1.0843 1.0554 1.0713 1.0612 1.0615 9.3537 6.0822 1.0811 1.0813 1.0692 1.0739 1.0620 1.0635 1.0632 1.0711 1.0715 1.0629 1.0560 1.0397 1.0539 1.0500 1.0630 1.0971 1.1011 1.1006 1.0976 1.1002 1.0963 1.0996 1.0963 1.0973 1.1026 1.0988 1.0984 1.0977 1.1582 1.0664
irintensity: 0.8540 1.1796 2.8718 0.4417 1.0946 0.7613 0.3323 0.2412 0.4730 2.7400 2.6694 0.1053 95.8288 11.2797 1.1798 8.5749 7.4415 0.9152 2.1546 1.3917 1.9004 2.6777 0.1975 3.0867 0.1466 4.1433 2.7443 1.3953 11.6417 0.8525 0.8535 2.8302 2.2584 0.2144 0.5371 2.5775 3.9305 3.8469 55.7657 18.1328 59.8177 6.1290 2.8697 4.0887 5.1080 6.8642 0.7565 1.8040 2.7550 2.1378 17.2584 21.3364 11.5680 1.2991 6.4940 2.6165 18.5347 15.9092 4.9108 2.4234 19.4589 5.5508 2.3055 2.6091 25.4101 8.5675 7.7982 3.0317 9.9200 4.8220 3.1340 1.8406 24.3699 4.5636 11.2668 0.7581 11.9333 0.8952 19.5842 10.7102 3.1545 11.0385 14.9573 11.6932 5.6899 1.5617 11.8289 10.9162 5.0603 12.0263 0.3854 8.6120 2.0580 7.4918 2.6047 17.7663 2.2128 0.7529 1.0348 2.1772 3.1508 4.0640 3.8272 0.6814 0.2815 1.9460 13.8939 30.8588 17.4246 13.4804 4.5136 16.1075 2.9530 3.3546 21.9233 5.0564 10.5467 4.3442 7.1373 0.2528 12.8435 224.3431 5.5677 9.7337 14.3960 10.5891 19.4440 12.8998 24.4828 28.5063 32.0749 39.8976 9.1946 28.9328 20.7783 32.0853 39.8266 30.5983 46.5420 20.6327 74.4511 41.8046 8.5049 24.3479 32.6496 29.0250 35.6265 50.8499 18.8670 41.4474 34.1225 78.8542 5.5314
temp: 298.150 k
press: 1.00000 atm
elementType: 8 8 6 6 6 6 6 6 6 6 6 6 6 6 6 6 6 6 6 6 6 6 6 1 1 1 1 1 1 1 1 1 1 1 1 1 1 1 1 1 1 1 1 1 1 1 1 1 1 1 1 1 1
symmnumber: 1
zpe: 1209843.2 jmol-1
zpe.correction: 0.460805 hartree
zpe.thermalcorrener: 0.483041 hartree
zpe.thermalcorrenthalpy: 0.483985 hartree
zpe.thermalcorrgfe: 0.412161 hartree
zpe.sumelectzpe: -966.848501 hartree
zpe.sumelectthermal: -966.826265 hartree
zpe.sumelectthermalent: -966.825321 hartree
zpe.sumelectthermalfe: -966.897145 hartree
dipole: -4.4930 0.5305 2.1558
dipole: 5.0116
quadrupole: -162.4376 -135.5464 -140.4810
quadrupole: -1.0430 12.5179 -2.1598
quadrupole: -16.2826 10.6086 5.6740 -1.0430 12.5179 -2.1598
hfenergy: -967.3093058 hartree
pointgroup: C01 [X(C21H30O2)]
dipole: -1.765532 0.2088739 0.8526086 debye
polarizability: 283.754655|11.7278374|201.9295816|-9.4153604|-2.9219016|172.0425404 unknown
InChI: InChI=1S/C21H30O2/c1-4-21(23)12-9-18-16-6-5-14-13-15(22)7-10-19(14,2)17(16)8-11-20(18,21)3/h1,14,16-18,23H,5-13H2,2-3H3
charge 0 multiplicity 1
53 atoms
O  -3.55583 -0.104511 -1.949961
O  6.104671 -0.225363 -1.12954
C  -0.121053 0.919027 0.367205
C  0.612453 -0.360038 -0.164734
C  -1.556484 0.933599 -0.196764
C  -2.381119 -0.333965 0.187339
C  2.115779 -0.434729 0.315386
C  2.819058 0.890995 -0.152682
C  -0.20527 -1.655109 0.11625
C  -1.674005 -1.581995 -0.384468
C  0.646771 2.205499 -0.023449
C  -3.759231 0.039371 -0.477621
C  -2.495443 2.115206 0.156947
C  2.129323 2.156597 0.40215
C  -3.93459 1.562662 -0.117468
C  2.837545 -1.616988 -0.4042
C  -2.59604 -0.484168 1.717523
C  2.207128 -0.63119 1.854171
C  4.345526 0.901569 0.140193
C  4.373661 -1.658578 -0.167282
C  5.047592 -0.318136 -0.44816
C  -4.905702 -0.790378 -0.074222
C  -5.888022 -1.477361 0.213437
H  -0.171185 0.875409 1.476234
H  0.652439 -0.244968 -1.274399
H  -1.469179 0.912093 -1.303908
H  2.702776 0.921717 -1.260289
H  -0.196996 -1.877416 1.200927
H  0.283339 -2.514909 -0.379601
H  -1.695695 -1.52737 -1.488096
H  -2.211998 -2.505493 -0.091888
H  0.151237 3.088215 0.425442
H  0.589724 2.334636 -1.12566
H  -2.279524 3.015046 -0.444381
H  -2.384063 2.396598 1.221751
H  2.659331 3.057146 0.032534
H  2.210583 2.176883 1.508154
H  -4.594396 1.682721 0.759685
H  -4.421883 2.077378 -0.965142
H  2.646132 -1.539474 -1.494415
H  2.41198 -2.582679 -0.073612
H  -1.637358 -0.61147 2.246916
H  -3.107219 0.387797 2.162328
H  -3.215369 -1.375089 1.925175
H  3.250486 -0.588918 2.21358
H  1.642228 0.137838 2.408637
H  1.803097 -1.617278 2.146482
H  4.511338 0.910373 1.237848
H  4.817298 1.813183 -0.268942
H  4.852848 -2.43412 -0.790275
H  4.572484 -1.920639 0.892713
H  -4.431794 0.027397 -2.394791
H  -6.738878 -2.079222 0.473938
