program: Gaussian 09
title: 000197013
version: EM64L-G09RevD.01
frameworkgroup: C1[X(C19H13F)]
method: RPBEPBE
basis: SDD
operation: Freq
keyword: #pfreq=noraman
keyword: PBEPBE/SDD
title: #p freq=noraman PBEPBE/SDD
converged: NO YES NO NO
title: Mulliken charges:
elementType: F C C C C C C C C C C C C C C C C C C C H H H H H H H H H H H H H
charge: -0.204691 0.230778 0.471964 0.271075 0.403615 0.430981 -0.617636 -0.710934 0.170494 -0.481824 -0.429483 -0.635048 -0.432480 -0.401093 0.454460 0.175786 -0.363623 -0.219386 -0.406501 -0.813337 0.229568 0.247645 0.243286 0.263444 0.244738 0.241236 0.228201 0.232072 0.231759 0.256464 0.226683 0.230898 0.230891
chargesum: 0.00000
title: Mulliken charges with hydrogens summed into heavy atoms:
elementType: F C C C C C C C C C C C C C C C C C C C
charge: -0.204691 0.230778 0.471964 0.271075 0.403615 0.430981 -0.388068 -0.463289 0.170494 -0.238538 -0.166039 -0.390309 -0.191244 -0.172893 0.454460 0.175786 -0.131551 0.012373 -0.150037 -0.124865
polarizability: 4.12823401e+02 1.25580007e+01 2.21544893e+02 3.43763383e-03 1.02376568e-03 8.19858690e+01
1716.lowfreq: -9.5209 -0.0009 -0.0006 0.0003 1.9069 6.3138 47.1781 67.1088 97.3403
frequency: 47.1727 67.1071 97.3377 115.3943 127.2489 175.0979 196.3630 235.3687 246.0598 267.2405 294.0380 327.4347 338.2294 396.0695 406.6052 458.2788 474.1504 482.7401 488.0925 508.0757 531.9494 550.1821 575.1672 583.6080 604.7172 615.5046 678.4055 700.4277 733.1039 759.5886 768.0257 782.5487 810.1147 819.7573 820.0599 837.5593 838.3065 874.4327 880.0464 887.6587 918.1338 937.8688 948.3369 966.4797 975.4807 990.5736 1005.6451 1030.1720 1049.8012 1066.2012 1141.9809 1158.2957 1175.8546 1186.3325 1193.7184 1219.3223 1233.3043 1237.6472 1273.0870 1289.1766 1297.7737 1317.8603 1385.5208 1390.9675 1398.8657 1411.6396 1416.8782 1426.0055 1443.3533 1456.7351 1467.8277 1472.0924 1492.0007 1501.3796 1553.0056 1565.2665 1600.9428 1623.5053 1627.0809 1643.9618 2973.1652 3049.5084 3086.7097 3113.8867 3114.5955 3117.3564 3129.5724 3136.9840 3139.8918 3145.0342 3165.6928 3171.8923 3179.8759
redmass: 6.0666 4.0029 1.4613 2.0863 5.0552 4.3570 4.1975 6.0176 4.1169 5.8309 4.6584 3.8336 4.3626 4.2668 3.1654 6.4913 2.5162 5.6257 3.6549 5.7249 3.8594 8.2073 5.3957 2.9386 4.3358 7.2538 6.6533 2.7433 6.1334 1.6249 5.8675 2.2453 1.4360 4.2218 2.2256 5.2289 1.5757 1.4774 4.5562 1.4388 1.5093 2.0577 2.7105 1.3355 1.3662 1.3677 1.8235 3.3035 1.5597 1.9325 1.7614 1.4460 1.2540 1.8081 1.3601 2.4083 1.8682 1.7136 2.4142 1.8242 2.7348 1.8295 5.0013 2.9464 1.2473 3.1981 5.8010 2.4830 6.1237 2.8925 1.0456 1.3322 2.5545 3.9187 5.3754 7.2596 6.0571 6.9005 7.1052 6.7540 1.0375 1.0974 1.0985 1.0905 1.0878 1.0910 1.0889 1.0901 1.0975 1.0870 1.0921 1.0959 1.0981
irintensity: 0.0003 0.4309 1.6489 0.9548 0.0968 0.5087 0.6493 3.1861 0.1617 0.3471 0.5531 7.5721 1.5219 1.5157 0.1217 4.2427 12.9500 0.1384 0.3276 0.5897 0.5212 0.8236 0.9584 6.3092 0.9319 8.0096 4.2287 0.4989 1.0222 52.1498 0.8824 17.0174 22.2181 1.7340 30.2753 13.1229 1.8776 1.5710 21.5336 1.8314 80.7689 0.0261 6.8025 2.1626 6.1058 1.6921 3.7218 40.3741 12.9780 8.8889 7.7077 12.4442 5.5266 5.1779 7.3074 44.5771 2.7197 5.2791 4.9530 4.9969 1.6002 1.4175 3.3557 13.6474 11.6026 12.6592 4.2354 3.6759 7.7712 32.2760 13.4378 6.8689 15.5727 23.2683 37.2886 5.8306 3.3770 4.0629 13.8011 21.7543 48.9605 20.6211 16.0803 12.3369 9.6878 10.2850 12.8129 12.7820 32.8623 1.8824 13.4127 11.1093 9.9031
temp: 298.150 k
press: 1.00000 atm
elementType: 9 6 6 6 6 6 6 6 6 6 6 6 6 6 6 6 6 6 6 6 1 1 1 1 1 1 1 1 1 1 1 1 1
symmnumber: 1
zpe: 672382.1 jmol-1
zpe.correction: 0.256097 hartree
zpe.thermalcorrener: 0.271166 hartree
zpe.thermalcorrenthalpy: 0.272110 hartree
zpe.thermalcorrgfe: 0.214112 hartree
zpe.sumelectzpe: -830.367387 hartree
zpe.sumelectthermal: -830.352317 hartree
zpe.sumelectthermalent: -830.351373 hartree
zpe.sumelectthermalfe: -830.409371 hartree
dipole: -2.7959 1.2310 -0.0006
dipole: 3.0549
quadrupole: -107.1048 -97.9512 -122.5928
quadrupole: 5.4762 -0.0027 0.0008
quadrupole: 2.1115 11.2651 -13.3765 5.4762 -0.0027 0.0008
hfenergy: -830.6234836 hartree
pointgroup: C01 [X(C19H13F1)]
dipole: -1.0893161 0.5078695 0.0033812 debye
polarizability: 413.2724698|8.41615|221.0675209|1.0792565|1.8827292|82.0141724 unknown
InChI: InChI=1S/C19H13F/c1-12-5-6-13-10-14-7-8-17-16(3-2-4-19(17)20)18(14)11-15(13)9-12/h2-11H,1H3
charge 0 multiplicity 1
33 atoms
F  5.218156 -0.871658 0.003373
C  0.375234 0.055551 0.001353
C  0.135979 -1.382377 -0.018643
C  1.763368 0.546449 0.011871
C  -2.078593 0.431026 -0.000741
C  -2.3087 -1.004328 -0.020946
C  -0.742209 0.917669 0.009735
C  -1.188316 -1.873395 -0.029292
C  2.835877 -0.416589 0.002306
C  1.260192 -2.29624 -0.027442
C  2.560117 -1.838443 -0.017382
C  -3.212398 1.316366 0.00801
C  -3.664686 -1.483382 -0.031578
C  2.097246 1.934476 0.031019
C  -4.523034 0.834212 -0.002473
C  4.169786 0.076076 0.012663
C  -4.733941 -0.593975 -0.022665
C  3.433158 2.366948 0.04049
C  4.500366 1.42886 0.031299
C  -5.721169 1.765267 0.006798
H  -0.600728 2.003561 0.024723
H  -1.352122 -2.958484 -0.044368
H  1.052795 -3.372618 -0.042444
H  3.40534 -2.532057 -0.024109
H  -3.031661 2.398987 0.02334
H  -3.843355 -2.5653 -0.046853
H  1.305652 2.688486 0.038618
H  -5.763354 -0.973524 -0.03092
H  3.662011 3.437394 0.055162
H  5.548023 1.742365 0.038428
H  -5.412882 2.82444 0.022446
H  -6.35512 1.608422 -0.886792
H  -6.360533 1.583715 0.891815
