program: Gaussian 09
title: 000189187
version: EM64L-G09RevD.01
frameworkgroup: C1[X(C14H18N5O6P)]
method: RPBEPBE
basis: SDD
operation: Freq
keyword: #p
keyword: freq=noraman
keyword: PBEPBE/SDD
title: #p freq=noraman PBEPBE/SDD
converged: NO YES NO NO
title: Mulliken charges:
elementType: P O O O O O O N N N N N C C C C C C C C C C C C C C H H H H H H H H H H H H H H H H H H
charge: 1.381512 -0.255437 -0.465532 -0.475351 -0.682932 -0.567341 -0.173552 -0.166944 -0.084910 -0.031733 -0.420483 0.016262 -0.115676 -0.019703 -0.529685 -0.061093 -0.340087 0.169760 -0.203714 -0.144388 0.199939 -0.363688 0.223912 -0.533032 -0.343707 -0.684115 0.280454 0.248619 0.267259 0.270996 0.277257 0.234557 0.263436 0.272927 0.410629 0.254343 0.343261 0.240804 0.214573 0.208949 0.242574 0.209288 0.225005 0.206792
chargesum: 0.00000
title: Mulliken charges with hydrogens summed into heavy atoms:
elementType: P O O O O O O N N N N N C C C C C C C C C C C C C C
charge: 1.381512 -0.255437 -0.465532 -0.475351 -0.272303 -0.567341 -0.173552 -0.166944 -0.084910 -0.031733 -0.077223 0.016262 0.164777 0.228916 0.008570 0.216163 0.157905 0.169760 0.069213 -0.144388 0.199939 -0.109345 0.223912 -0.077654 0.107815 -0.043030
polarizability: 3.64779431e+02 3.40938483e+00 2.12597921e+02 3.89129965e+00 -6.00147809e+00 1.42859921e+02
1716.lowfreq: -10.4901 -3.6858 0.0006 0.0015 0.0021 0.4161 10.4506 14.8574 18.5095
frequency: 9.3188 14.7735 18.1558 30.7972 35.6945 37.6157 53.2739 67.7409 79.8660 101.2922 112.5756 135.4785 151.8080 162.3613 191.6127 197.8827 208.7870 228.5202 231.2655 240.4857 260.0674 278.4330 292.0689 299.5484 309.4356 342.6107 361.4638 365.2960 384.8680 409.0134 459.5333 492.4018 522.8843 537.0156 565.5261 573.5679 589.1864 603.8520 626.1748 644.3244 663.9692 665.1684 684.7628 694.4160 714.3131 725.5965 735.1004 745.3610 777.7420 801.5051 829.4799 832.7057 844.0274 861.6202 869.8638 890.5741 907.7001 916.3202 928.9692 945.3592 971.6723 986.5087 1003.1778 1015.4577 1027.2948 1055.6214 1072.5049 1080.3983 1087.4594 1105.2863 1106.6603 1111.2152 1132.6050 1141.0892 1153.9919 1156.1742 1201.5211 1220.6785 1225.0537 1241.1940 1256.5722 1268.5144 1277.3525 1285.9394 1290.3033 1297.0704 1305.7868 1309.2466 1335.8469 1349.8490 1355.4812 1357.5555 1371.0560 1384.0918 1393.5205 1406.8805 1417.0428 1441.5570 1444.0301 1470.5323 1471.7211 1475.2212 1479.0414 1481.4078 1486.3583 1550.3941 1575.5172 1661.4990 2964.2768 2973.3955 2975.6449 2998.8783 3003.1430 3017.6246 3026.0147 3040.1268 3050.1412 3050.4945 3076.7821 3079.0751 3120.6530 3125.5352 3175.2289 3241.0103 3492.8561 3605.8146
redmass: 4.7181 6.7885 4.2083 5.6876 2.6666 2.0740 3.2947 4.1360 4.7915 4.6030 3.4827 5.8194 4.7450 4.4969 5.7481 3.9922 5.7432 6.4490 1.1524 4.6871 5.8804 4.5324 5.0357 4.6779 4.9794 6.1236 3.3385 5.3533 6.6380 5.4617 5.5917 4.4562 7.4626 3.8562 3.9814 3.8576 5.2508 6.9684 6.8693 5.2424 4.7835 5.9302 10.3898 7.7046 6.7780 4.2052 1.2353 1.3377 4.3868 3.8566 1.9627 2.7466 5.1126 4.9031 1.7432 3.2006 2.3699 8.0388 1.4488 2.5405 2.2059 1.3062 5.8705 3.9046 4.1349 2.3849 2.0871 1.9339 2.8926 2.5844 4.4081 3.7640 3.4782 1.5111 2.5987 2.2222 1.5436 1.6732 1.3407 1.2110 1.2553 4.1940 1.2463 3.6210 1.4365 1.3027 1.5509 3.1283 1.3008 2.0471 1.4943 1.4752 3.0459 1.5415 1.2146 1.5786 2.8583 1.1009 2.8168 1.0936 1.0898 1.0542 1.0446 2.8026 1.0805 9.4948 4.9166 5.7606 1.0593 1.0363 1.0833 1.0651 1.0858 1.0966 1.0629 1.0688 1.0808 1.0993 1.0989 1.1017 1.1041 1.1051 1.0925 1.0983 1.0766 1.0665
irintensity: 3.0548 0.3066 3.6940 15.4433 55.6508 22.2557 1.4650 8.6482 5.9967 2.7499 20.0744 1.4089 1.9065 2.5562 0.5593 6.4501 6.8029 6.0166 0.0293 7.3389 3.7695 19.7397 7.0994 2.1911 18.6426 11.8207 1.6361 19.7330 6.5714 22.3575 10.8054 7.1780 11.0791 4.6744 6.9094 5.4571 6.0214 33.3381 9.9527 5.8471 16.4646 41.0253 119.6067 153.4937 111.4905 38.0443 34.0719 43.6889 3.0890 24.4140 4.2215 23.9994 3.8591 153.3437 5.1429 14.5231 7.5381 135.1832 11.5384 20.0406 22.5658 32.0583 175.5547 23.3197 7.1054 22.3948 98.5408 115.6783 139.5212 6.5527 85.4038 3.7220 75.4903 5.4474 115.3601 53.9943 40.9708 72.8983 0.2577 14.3118 42.1274 143.2034 28.2547 5.8642 1.6348 17.1454 6.6350 28.6617 5.4197 171.2063 41.2841 63.4678 35.7749 2.6068 8.7312 61.6782 493.9784 14.2533 7.6959 22.3565 2.3519 10.9661 12.7677 86.1547 15.6840 222.4335 628.0522 107.7356 15.8474 39.7810 13.2809 22.3566 25.6720 15.1663 30.6883 1.4193 6.5313 1.9672 48.9619 67.6726 11.8257 8.3374 11.4867 0.0504 27.1671 96.1213
temp: 298.150 k
press: 1.00000 atm
elementType: 15 8 8 8 8 8 8 7 7 7 7 7 6 6 6 6 6 6 6 6 6 6 6 6 6 6 1 1 1 1 1 1 1 1 1 1 1 1 1 1 1 1 1 1
symmnumber: 1
zpe: 864737.3 jmol-1
zpe.correction: 0.329361 hartree
zpe.thermalcorrener: 0.354621 hartree
zpe.thermalcorrenthalpy: 0.355565 hartree
zpe.thermalcorrgfe: 0.268656 hartree
zpe.sumelectzpe: -1608.656213 hartree
zpe.sumelectthermal: -1608.630954 hartree
zpe.sumelectthermalent: -1608.630010 hartree
zpe.sumelectthermalfe: -1608.716918 hartree
dipole: -0.5586 -4.8967 0.7389
dipole: 4.9835
quadrupole: -207.8860 -152.6857 -160.3003
quadrupole: -12.8663 -5.2137 -0.9592
quadrupole: -34.2620 20.9383 13.3237 -12.8663 -5.2137 -0.9592
hfenergy: -1608.9855745 hartree
pointgroup: C01 [X(C14H18N5O6P1)]
dipole: -0.2041033 1.9500065 -0.008147 debye
polarizability: 364.4113751|-3.9617428|212.9291111|-9.3669389|4.2199271|142.896786 unknown
InChI: InChI=1S/C14H18N5O6P/c1-2-3-10(20)18-13-12-14(16-6-15-13)19(7-17-12)11-4-8-9(24-11)5-23-26(21,22)25-8/h6-9,11,18,21H,2-5H2,1H3
charge 0 multiplicity 1
44 atoms
P  -6.302126 0.958305 0.575335
O  -2.547007 -0.631887 -1.264473
O  -5.058915 0.005258 1.354761
O  -6.100867 0.612218 -1.117992
O  -5.609977 2.540318 0.728998
O  -7.76633 0.757329 1.114632
O  6.096792 -0.956872 -0.21316
N  -0.490274 -0.53552 -0.054389
N  1.161352 1.060279 -0.044479
N  0.933346 -2.571701 -0.204145
N  4.091013 0.291752 -0.176686
N  3.333509 -2.013369 -0.265481
C  -3.775497 0.076051 0.617511
C  -3.937071 -0.45086 -0.825228
C  -2.701981 -0.86065 1.182717
C  -1.805427 -1.160645 -0.06773
C  -4.720528 0.528629 -1.700768
C  0.72747 -1.230273 -0.137871
C  -0.1627 0.831745 -0.007564
C  1.731051 -0.22647 -0.122852
C  3.082179 -0.674111 -0.189366
C  2.267202 -2.874803 -0.269047
C  5.504489 0.147228 -0.209979
C  6.23719 1.496978 -0.271193
C  7.618352 1.445129 0.41899
C  8.431613 2.736548 0.19625
H  -3.432821 1.129807 0.594779
H  -4.475795 -1.421963 -0.795785
H  -2.12299 -0.421715 2.008288
H  -3.180122 -1.788134 1.541287
H  -1.625084 -2.241349 -0.204288
H  -4.25574 1.531517 -1.717419
H  -4.884741 0.16447 -2.72533
H  -0.921775 1.608859 0.031878
H  -6.252899 3.250628 0.980635
H  2.519434 -3.936968 -0.331261
H  3.730929 1.252067 -0.140051
H  6.377809 1.7484 -1.343538
H  5.61845 2.307742 0.163114
H  7.477859 1.26753 1.50273
H  8.168014 0.569007 0.030665
H  8.619985 2.907927 -0.88065
H  9.411625 2.678387 0.703229
H  7.901602 3.624283 0.590826
