program: Gaussian 09
title: 000189179
version: EM64L-G09RevD.01
frameworkgroup: C1[X(C3H5F2NO2)]
method: RPBEPBE
basis: SDD
operation: Freq
keyword: #p
keyword: freq=noraman
keyword: PBEPBE/SDD
title: #p freq=noraman PBEPBE/SDD
converged: YES YES NO NO
title: Mulliken charges:
elementType: F F O O N C C C H H H H H
charge: -0.196535 -0.185520 -0.395350 -0.213873 -0.575512 -0.257146 0.137453 0.192166 0.272323 0.231798 0.312755 0.293275 0.384167
chargesum: 0.00000
title: Mulliken charges with hydrogens summed into heavy atoms:
elementType: F F O O N C C C
charge: -0.196535 -0.185520 -0.011184 -0.213873 0.030518 0.015177 0.369251 0.192166
polarizability: 4.37959610e+01 2.43290008e+00 5.17296791e+01 -3.93376688e+00 2.68963932e+00 4.20112596e+01
1716.lowfreq: -9.0017 -0.0009 -0.0006 -0.0003 8.1106 10.9375 30.0540 80.3714 148.0229
frequency: 29.7984 80.3596 148.0225 201.3603 241.8313 283.5222 355.4455 405.5058 478.9805 524.3586 604.8402 638.1121 656.8937 739.8606 778.4631 936.3013 979.8116 1044.9794 1060.5711 1129.9237 1187.3744 1232.8928 1276.1188 1293.2042 1341.5595 1370.6686 1651.7101 1665.2636 3067.5426 3096.8689 3481.2153 3503.3661 3611.4824
redmass: 11.2074 7.0238 8.5640 4.3228 1.9174 1.9847 4.7340 5.8197 4.3539 5.8115 2.1460 1.7595 1.6022 4.1991 4.5400 4.1267 6.6820 2.4769 3.0498 1.8136 2.0531 1.4226 1.3584 1.5349 1.3304 1.5458 1.1186 7.5533 1.0849 1.0900 1.0459 1.0641 1.0981
irintensity: 0.9312 1.4890 3.5675 4.0367 21.3973 32.3221 13.0948 5.8846 35.0220 14.3732 61.5670 117.5755 331.3183 6.7731 14.9083 82.3576 27.9340 260.8080 94.3730 25.3300 7.8070 11.0021 24.8981 30.6287 5.1272 7.4658 86.2128 187.9170 3.6245 25.1903 8.7225 19.5229 14.9629
temp: 298.150 k
press: 1.00000 atm
elementType: 9 9 8 8 7 6 6 6 1 1 1 1 1
symmnumber: 1
zpe: 233859.2 jmol-1
zpe.correction: 0.089072 hartree
zpe.thermalcorrener: 0.097666 hartree
zpe.thermalcorrenthalpy: 0.098610 hartree
zpe.thermalcorrgfe: 0.054740 hartree
zpe.sumelectzpe: -521.560995 hartree
zpe.sumelectthermal: -521.552402 hartree
zpe.sumelectthermalent: -521.551457 hartree
zpe.sumelectthermalfe: -521.595328 hartree
dipole: -1.4425 0.7978 -2.5960
dipole: 3.0751
quadrupole: -44.0484 -43.5728 -46.6925
quadrupole: 4.0741 0.6674 -3.8466
quadrupole: 0.7228 1.1984 -1.9212 4.0741 0.6674 -3.8466
hfenergy: -521.6500673 hartree
pointgroup: C01 [X(C3H5F2N1O2)]
dipole: -0.6145142 -0.3355715 0.9866636 debye
dipolederiv: -0.3653606 -0.0033048 0.0905385 -0.0180769 -0.3255517 -0.0573558 0.1817272 -0.1481488 -0.7170353 -0.3506192 -0.1194517 0.0027482 -0.1922015 -0.8183776 -0.115434 0.027425 -0.0195494 -0.3050573 -0.4245563 0.2961165 0.1839651 0.1938508 -1.0801321 -0.2801628 0.1218271 -0.2143643 -0.3891884 -0.5591256 -0.0585808 -0.2947271 0.0843158 -0.6290488 -0.128021 -0.2249709 -0.2905028 -0.6686649 -0.6656015 0.1867099 -0.1772108 0.1160131 -0.6894832 0.1157991 -0.1348515 0.0777773 -0.2879387 -0.0696334 0.033215 0.0254491 -0.0410503 0.4729869 -0.1162369 -0.0203628 -0.0272714 0.079024 0.9161316 0.0854057 -0.0900391 0.2617793 1.0853891 0.1778541 -0.2383248 0.1863077 1.0079524 0.7354888 -0.2826678 0.3288614 -0.3663137 1.1733708 0.4347925 0.3679451 0.5456646 0.7653628 0.0879583 0.0073676 0.0283665 0.0065512 0.0527267 -0.0313714 -0.0006957 -0.0429788 -0.0316259 -0.0734671 0.0554127 -0.076067 0.0306813 0.0118623 0.0189152 -0.01349 0.0138386 -0.002672 0.350404 -0.1316969 -0.0282936 -0.0581833 0.2284583 0.0138211 0.0034614 -0.0399798 0.1109758 0.1810497 -0.1378498 0.1557925 -0.0516572 0.1881832 -0.0324775 0.0929922 -0.0593439 0.2111632 0.2373313 0.0693245 -0.1493836 0.0342913 0.329616 -0.0001226 -0.1626823 0.0185511 0.2277043 unknown
polarizability: 43.4510352|-2.7056711|51.5944942|3.9355163|2.7503154|42.4913703 unknown
InChI: InChI=1S/C3H5F2NO2/c4-2(5)1(6)3(7)8/h1-2,7H,6H2
charge 0 multiplicity 1
13 atoms
F  1.502198 -0.214979 -1.173665
F  1.476846 1.477993 0.380027
O  -1.52896 1.446111 0.352749
O  -1.74793 -0.362927 -1.09564
N  -0.016033 -1.896345 0.652015
C  -0.036786 -0.437917 0.701994
C  1.343953 0.063294 0.228012
C  -1.179822 0.187862 -0.13137
H  -0.149136 -0.095389 1.744962
H  2.16556 -0.437299 0.766858
H  -0.092156 -2.271867 -0.298751
H  -0.644016 -2.358275 1.312596
H  -2.236317 1.850639 -0.220385
