program: Gaussian 09
title: 000189178
version: EM64L-G09RevD.01
frameworkgroup: C1[X(C6H3I2N2O3S)]
method: RPBEPBE
basis: SDD
operation: Freq
keyword: #p
keyword: freq=noraman
keyword: PBEPBE/SDD
title: #p freq=noraman PBEPBE/SDD
converged: NO YES NO NO
title: Mulliken charges:
elementType: I I S O O O N N C C C C C C H H H
charge: 0.389376 0.389512 1.035476 -0.553606 -0.440734 -0.440834 0.012124 0.168818 -0.078717 -0.101958 -0.101579 -0.558207 -0.558440 0.757225 0.331685 0.331701 0.418159
chargesum: 1.00000
title: Mulliken charges with hydrogens summed into heavy atoms:
elementType: I I S O O O N N C C C C C C
charge: 0.389376 0.389512 1.035476 -0.135447 -0.440734 -0.440834 0.012124 0.168818 -0.078717 0.229726 0.230121 -0.558207 -0.558440 0.757225
polarizability: 2.44322751e+02 -7.14042969e-02 2.32274989e+02 8.09795718e-04 -3.02300488e+00 6.84766278e+01
1716.lowfreq: -2.6985 -2.6373 0.0013 0.0017 0.0019 3.1920 25.1215 46.5142 70.0526
frequency: 25.0864 46.5089 70.0459 74.0401 91.6629 121.1976 154.7927 160.4503 171.7127 177.4101 231.9779 233.0369 256.4231 259.3257 290.0244 326.3050 392.7770 402.4181 484.8935 505.0132 543.6860 570.4778 574.2432 599.6801 686.5584 745.7388 773.1460 836.8940 901.8413 917.6228 976.6256 1025.7707 1048.8209 1076.1559 1171.1965 1193.5906 1337.6867 1347.0013 1357.2853 1525.0862 1530.1511 2089.8531 3159.5731 3161.7841 3474.6646
redmass: 11.1525 16.2479 8.6764 17.9372 34.1083 15.0410 4.5488 11.5590 20.0536 7.3652 1.4981 12.3209 9.1660 7.9717 4.2003 11.1753 8.2885 12.8935 12.9019 5.1806 11.2126 8.0735 9.2214 6.0367 9.9918 4.9128 7.0428 14.6307 1.5247 1.3565 18.9996 6.8317 1.1783 2.6940 4.1015 1.5928 2.4196 4.7152 4.4668 9.7141 6.0732 13.9772 1.0932 1.0948 1.0665
irintensity: 0.9293 0.7145 0.9286 0.7192 0.0661 0.0014 1.5633 0.3642 0.3205 11.4406 46.3219 14.1069 2.0806 7.2307 85.8627 10.2401 2.4806 86.9099 21.1826 0.0007 66.3350 1.5911 43.1968 57.6391 43.4133 20.0918 12.4560 62.1163 18.6392 1.0883 55.3956 10.1704 72.8842 8.2760 48.3113 57.8228 9.4152 2.8216 294.1863 206.8656 206.0814 176.8208 20.7800 39.6421 132.5207
temp: 298.150 k
press: 1.00000 atm
elementType: 53 53 16 8 8 8 7 7 6 6 6 6 6 6 1 1 1
symmnumber: 1
zpe: 221908.7 jmol-1
zpe.correction: 0.084521 hartree
zpe.thermalcorrener: 0.099829 hartree
zpe.thermalcorrenthalpy: 0.100773 hartree
zpe.thermalcorrgfe: 0.037876 hartree
zpe.sumelectzpe: -985.155658 hartree
zpe.sumelectthermal: -985.140349 hartree
zpe.sumelectthermalent: -985.139405 hartree
zpe.sumelectthermalfe: -985.202302 hartree
dipole: 0.0046 -4.3578 1.7380
dipole: 4.6916
quadrupole: -85.5130 -87.5130 -113.8571
quadrupole: -0.0039 -0.0204 11.9298
quadrupole: 10.1147 8.1147 -18.2294 -0.0039 -0.0204 11.9298
hfenergy: -985.2401781 hartree
pointgroup: C01 [X(C6H3I2N2O3S1)]
dipole: 1.7252395 -0.0181341 0.65595 debye
dipolederiv: 0.0537477 -0.3443621 0.0105356 -0.168626 -0.2390595 0.0159605 -0.0074767 0.0151573 0.2580144 0.0749704 0.3298048 -0.0095421 0.1542328 -0.2621811 0.0142547 -0.0169765 0.015422 0.2582346 2.1680394 -0.0239655 -0.062816 -0.0296007 1.1190887 0.0158366 -0.2770503 0.0202653 1.6019893 -0.552906 0.0078611 0.2112203 0.0147425 -0.5043012 -0.0179032 0.4550428 -0.0235074 -0.9598539 -0.661231 -0.0003437 0.0087667 0.0426555 -0.4728557 0.0935745 0.013929 0.0165987 -0.4528495 -0.6624243 0.0085288 0.0043923 -0.0345588 -0.4781477 -0.0923317 0.0155897 -0.0153758 -0.4463553 1.5886537 -0.0320893 0.0113469 -0.0237248 0.1552838 0.0006087 0.014942 0.0004106 0.1803811 -0.6235608 0.0118938 -0.0063804 0.0081335 0.0104091 0.0029728 -0.0069932 0.0031694 0.1079631 0.1162315 0.0165731 -0.0146662 0.009354 0.9083986 -0.0291894 -0.2242968 -0.0248107 -0.0860486 -0.667064 0.9645835 -0.0286537 0.2027944 -0.6301707 0.0142738 0.0320395 0.0430372 0.0481613 -0.7155078 -0.9614705 0.0287179 -0.1954749 -0.5821145 0.0246521 0.0425678 -0.0057975 0.0493475 0.6744723 1.1062209 -0.0283648 0.0084069 0.7919528 -0.0328433 0.0278331 -0.0284064 -0.1864206 0.6291161 -1.0974059 0.037086 -0.0023352 0.8357107 -0.0267602 0.0279305 -0.0317353 -0.1864929 -0.9967544 0.0180336 -0.0050161 0.0153989 -0.2815757 0.0139821 -0.0141201 0.0139762 0.1864813 0.1784604 -0.0123517 -0.0088155 0.0440666 0.1332683 0.0030875 -0.0053924 -0.0091301 0.1514367 0.1767832 0.0100148 -0.0095936 -0.0461688 0.1351012 -0.0017134 -0.0022202 0.0102705 0.1509913 0.2189736 -0.0015258 -0.1382174 0.0007041 0.3611929 0.001538 -0.0753481 0.0004558 0.3250202 unknown
polarizability: 232.3397627|0.3539116|244.1575937|0.2831394|-5.2297065|68.577011 unknown
InChI: InChI=1S/C6H3I2N2O3S/c7-4-1-3(14(11,12)13)2-5(8)6(4)10-9/h1-2,11H
charge 1 multiplicity 1
17 atoms
I  2.139371 3.105546 -0.121257
I  2.005986 -3.123774 0.063678
S  -2.915015 0.095663 -0.086343
O  -3.002698 0.153622 1.74662
O  -3.362442 1.506228 -0.726213
O  -3.423494 -1.331019 -0.63888
N  3.102244 -0.030602 -0.012417
N  4.26127 -0.049642 -0.002067
C  -1.005324 0.056306 -0.040021
C  -0.390402 -1.205075 -0.003998
C  -0.336788 1.290048 -0.078311
C  1.070401 1.285115 -0.07065
C  1.015694 -1.259676 0.005006
C  1.730791 -0.00177 -0.023629
H  -0.997811 -2.115978 0.000738
H  -0.904603 2.224709 -0.128635
H  -3.958478 0.181501 2.047979
