program: Gaussian 09
title: 000189177
version: EM64L-G09RevD.01
frameworkgroup: C1[X(C6H2I2N2O3S)]
method: RPBEPBE
basis: SDD
operation: Freq
keyword: #p
keyword: freq=noraman
keyword: PBEPBE/SDD
title: #p freq=noraman PBEPBE/SDD
converged: YES YES NO NO
title: Mulliken charges:
elementType: I I S O O O N N C C C C C C H H
charge: 0.243330 0.243344 1.081078 -0.498512 -0.527940 -0.527946 -0.025590 0.083358 -0.189650 -0.102740 -0.102794 -0.517179 -0.517212 0.714905 0.321774 0.321775
chargesum: 0.00000
title: Mulliken charges with hydrogens summed into heavy atoms:
elementType: I I S O O O N N C C C C C C
charge: 0.243330 0.243344 1.081078 -0.498512 -0.527940 -0.527946 -0.025590 0.083358 -0.189650 0.219034 0.218981 -0.517179 -0.517212 0.714905
polarizability: 2.28692604e+02 -6.13368839e-02 3.58942326e+02 1.33547666e-03 1.92400579e+00 7.03383254e+01
1716.lowfreq: -3.2103 -2.9170 0.0006 0.0014 0.0017 2.4223 24.1260 42.7354 52.1556
frequency: 24.1233 42.7354 52.1555 71.2360 89.6913 111.6228 125.9877 154.6130 162.1650 183.6065 225.8361 248.4432 262.9838 301.0400 336.4868 395.7816 414.0976 443.2814 486.8682 556.2359 567.1077 572.8958 669.0930 692.4014 720.2005 760.7248 795.7488 866.3321 890.6332 912.0278 1007.0639 1053.8710 1179.6270 1200.5234 1322.3881 1336.8433 1406.4823 1485.7741 1525.9724 2033.7918 3149.1492 3151.3443
redmass: 16.6844 14.4915 15.9106 21.9991 34.8463 12.2940 15.0193 4.7794 34.6008 14.8606 12.8620 8.2878 12.4327 11.4192 16.0772 9.6133 20.5829 13.2003 5.4321 6.6949 8.1181 8.0842 9.8367 16.7215 4.7351 8.0186 15.3566 17.5160 1.4640 1.3447 7.6798 2.5620 1.5381 3.7270 3.3690 2.6078 8.7497 9.9189 7.1914 13.9578 1.0921 1.0941
irintensity: 0.0471 1.4066 2.7273 4.9547 0.7199 5.9890 0.1309 0.0610 0.7861 0.8996 8.4129 2.5657 0.6138 19.0458 11.6397 0.6193 47.1968 0.9967 0.0051 13.6789 1.7031 2.5141 71.4168 4.5172 19.8454 5.7742 59.2733 46.6362 21.0923 0.0811 54.6520 0.6125 13.9774 7.7543 45.9348 0.3746 119.7888 168.7337 132.5245 1132.1671 5.8770 22.8138
temp: 298.150 k
press: 1.00000 atm
elementType: 53 53 16 8 8 8 7 7 6 6 6 6 6 6 1 1
symmnumber: 1
zpe: 191336.6 jmol-1
zpe.correction: 0.072876 hartree
zpe.thermalcorrener: 0.087819 hartree
zpe.thermalcorrenthalpy: 0.088763 hartree
zpe.thermalcorrgfe: 0.025983 hartree
zpe.sumelectzpe: -984.787195 hartree
zpe.sumelectthermal: -984.772253 hartree
zpe.sumelectthermalent: -984.771308 hartree
zpe.sumelectthermalfe: -984.834088 hartree
dipole: 0.0024 -12.9346 -0.3577
dipole: 12.9396
quadrupole: -104.4263 -156.8828 -124.1109
quadrupole: 0.0116 -0.0002 -0.2675
quadrupole: 24.0470 -28.4094 4.3624 0.0116 -0.0002 -0.2675
hfenergy: -984.8600714 hartree
pointgroup: C01 [X(C6H2I2N2O3S1)]
dipole: 5.089489 0.0068913 -0.1159001 debye
dipolederiv: -0.0697517 -0.3464217 -0.0006202 -0.2347396 -0.4281013 0.0025513 -0.0018772 0.0036259 0.1186977 -0.0710913 0.3474242 -0.0008695 0.2358679 -0.4266305 -0.0020551 -0.0021086 -0.0031848 0.1187356 0.9593047 0.0000951 0.0502974 -0.0000649 0.8764331 0.0000829 0.7347472 0.0010565 0.782444 -0.5377072 -0.0002291 0.0232192 -0.0001409 -0.4053395 0.0000064 -0.3107332 -0.0004473 -0.4212086 -0.4190318 0.006687 -0.0108674 0.0438371 -0.5220097 0.0257022 -0.0986923 0.0599577 -0.4513835 -0.4187895 -0.006436 -0.0107817 -0.0433628 -0.5222698 -0.0256986 -0.0985264 -0.0602049 -0.4513035 3.0594568 0.0038879 0.016928 0.0071178 0.0889666 0.0002674 0.1058274 0.0005549 0.1459917 -2.5207457 -0.00367 -0.0299307 -0.0056737 -0.0326738 -0.0001303 -0.0763974 -0.0004045 0.023309 0.1248167 -0.0007324 -0.0866332 -0.0006653 0.6504317 -0.0004549 -0.2822877 -0.0006909 -0.094801 -0.3652282 0.6394989 0.0288662 0.3649756 -0.5024704 -0.0247929 0.0233468 0.0300682 0.0615459 -0.3627055 -0.6394697 0.0293337 -0.3644415 -0.5048308 0.0253336 0.0238158 -0.0296006 0.0615509 0.6883288 0.8877101 -0.0207628 0.4013956 0.9036925 -0.0046128 0.0126161 0.0037866 -0.1606051 0.6913819 -0.8877225 -0.0201078 -0.4017273 0.899755 0.003633 0.0130985 -0.004621 -0.1606146 -1.0016083 -0.0007683 0.0247724 -0.0022322 -0.2633174 0.0000701 -0.0282452 0.0000715 0.1455351 0.1215517 -0.0483016 0.0036116 0.0665992 0.0942916 0.0019356 -0.0073131 -0.0030121 0.1410484 0.1218185 0.0484482 0.0035448 -0.0667449 0.0940726 -0.001838 -0.0072706 0.0030448 0.1410581 unknown
polarizability: 358.9539093|0.2141892|228.6928967|-0.5151413|-0.0706558|70.32645 unknown
InChI: InChI=1S/C6H2I2N2O3S/c7-4-1-3(14(11,12)13)2-5(8)6(4)10-9/h1-2H
charge 0 multiplicity 1
16 atoms
I  2.024896 3.119475 -0.003081
I  2.033355 -3.113937 -0.000251
S  -2.998148 -0.004095 -0.021317
O  -3.084507 -0.003415 1.649667
O  -3.407931 1.403134 -0.74855
O  -3.403987 -1.413154 -0.747231
N  3.036319 0.004254 0.054201
N  4.207066 0.00667 0.087766
C  -1.091554 -0.001468 -0.045301
C  -0.422647 -1.248204 -0.032766
C  -0.426091 1.247116 -0.033919
C  0.967439 1.266822 -0.002122
C  0.970933 -1.264101 -0.000965
C  1.68001 0.002357 0.021852
H  -1.019757 -2.165602 -0.076536
H  -1.025693 2.162848 -0.07855
