program: Gaussian 09
title: 000196991
version: EM64L-G09RevD.01
frameworkgroup: C1[X(C18H14O2)]
method: RPBEPBE
basis: SDD
operation: Freq
keyword: #pfreq=noraman
keyword: PBEPBE/SDD
title: #p freq=noraman PBEPBE/SDD
converged: NO YES NO YES
title: Mulliken charges:
elementType: O O C C C C C C C C C C C C C C C C C C H H H H H H H H H H H H H H
charge: -0.203140 -0.261336 0.107880 -0.518877 0.276410 0.169361 -0.532078 0.278475 -0.016124 0.183935 -0.445973 -0.405814 -0.447370 0.456499 -0.490118 -0.352142 -0.594134 0.324438 -0.388025 -0.535348 0.240984 0.240975 0.252006 0.252011 0.270858 0.226024 0.243794 0.240073 0.222745 0.265947 0.244177 0.222771 0.222771 0.248348
chargesum: 0.00000
title: Mulliken charges with hydrogens summed into heavy atoms:
elementType: O O C C C C C C C C C C C C C C C C C C
charge: -0.203140 -0.261336 0.107880 -0.036918 0.276410 0.169361 -0.028061 0.278475 -0.016124 0.183935 -0.175114 -0.179791 -0.203576 0.456499 -0.250045 -0.129398 -0.328187 0.324438 -0.143849 0.158541
polarizability: 4.02219622e+02 -4.08113912e+00 2.02985104e+02 -7.80951325e-03 8.96987298e-03 8.84643877e+01
1716.lowfreq: -5.9969 -4.5274 -3.9486 -0.0006 0.0003 0.0004 38.2776 68.0739 77.7999
frequency: 38.2619 68.0700 77.7846 93.9856 113.4615 117.5581 180.6373 206.9317 209.6892 240.0296 250.1788 251.1661 307.6806 348.3964 378.6839 407.5040 471.1417 473.3281 489.4800 502.9673 511.1444 542.6550 563.4781 563.6399 591.8279 615.3857 641.2240 653.5426 689.1232 712.4129 728.4600 780.4405 810.3488 812.1871 819.0177 853.8663 857.8032 860.9649 903.2507 903.6897 933.1853 946.9039 978.4072 984.1643 998.6187 1000.3803 1002.8740 1033.2154 1059.6211 1110.1399 1134.3526 1142.6581 1145.7221 1170.5183 1175.9418 1183.3099 1200.6355 1235.7593 1243.8602 1256.5667 1266.5391 1273.0246 1289.7597 1324.1364 1377.7273 1383.7923 1409.9241 1424.2270 1431.7539 1434.3363 1443.5265 1459.1251 1466.7885 1467.1008 1471.7991 1498.1941 1538.4561 1581.6739 1601.8445 1617.9088 1631.8929 1634.5367 2960.5023 2987.2553 3017.0418 3032.5444 3049.9655 3074.1104 3125.8995 3126.9501 3139.8198 3148.4195 3150.9150 3152.5940 3163.9733 3171.4346
redmass: 4.6409 4.2387 3.1272 2.4474 3.5833 5.2464 3.5323 4.2000 1.4784 3.1920 2.6124 7.8415 4.8906 5.2896 5.0926 3.1105 2.9229 6.0618 5.3773 3.3157 5.3831 5.3645 5.6337 2.9440 2.6746 6.2680 6.2578 2.9889 6.3192 6.4953 2.5750 1.6153 5.2318 1.3990 1.5284 1.8170 5.9282 2.8294 4.5736 1.7620 5.1622 1.4135 1.4676 1.3946 1.9240 3.1109 3.0415 4.2302 4.4887 1.2576 1.2096 1.4520 1.5579 1.2683 1.8575 1.6214 1.1166 1.6944 1.4803 2.2699 2.0352 1.7576 2.4186 2.9124 3.9911 2.5579 6.5655 4.3237 1.2823 1.2730 2.3184 1.6350 1.0504 1.5075 1.1399 3.8128 4.5287 7.9738 7.2710 7.8058 8.4331 7.8894 1.0329 1.0598 1.0618 1.1021 1.1042 1.1015 1.0863 1.0993 1.0876 1.0872 1.0962 1.0935 1.0961 1.0950
irintensity: 0.4132 7.5892 2.7021 0.7555 0.5171 2.3408 2.4921 1.1765 0.6989 1.2438 8.7490 0.5413 13.9333 0.2765 0.6217 3.8607 3.1387 0.9183 6.3835 0.2795 3.3732 14.1634 9.5609 1.7438 0.0052 0.4768 3.8654 0.8667 28.8569 0.1497 4.2898 1.0176 1.0061 103.0891 0.0079 4.3734 4.9241 0.7864 1.8436 52.5311 1.4228 0.3511 1.0140 1.0575 0.0129 8.7028 93.4488 12.8771 71.8729 0.1622 0.0031 2.2436 25.7682 100.5156 1.0918 47.3454 0.0925 43.3454 5.5802 189.7174 4.1339 55.7023 168.7076 16.6604 1.2804 14.3425 2.2468 13.5792 4.9114 7.3994 15.4686 28.9020 13.8540 35.6393 34.0819 7.0330 179.5650 53.6397 128.7774 218.6238 264.8919 54.0876 87.8743 18.2873 18.4395 8.1878 46.7090 12.4878 1.0927 28.6341 2.1125 3.6237 11.3947 16.9826 4.4967 26.5956
temp: 298.150 k
press: 1.00000 atm
elementType: 8 8 6 6 6 6 6 6 6 6 6 6 6 6 6 6 6 6 6 6 1 1 1 1 1 1 1 1 1 1 1 1 1 1
symmnumber: 1
zpe: 699263.5 jmol-1
zpe.correction: 0.266335 hartree
zpe.thermalcorrener: 0.282251 hartree
zpe.thermalcorrenthalpy: 0.283195 hartree
zpe.thermalcorrgfe: 0.222886 hartree
zpe.sumelectzpe: -843.414267 hartree
zpe.sumelectthermal: -843.398352 hartree
zpe.sumelectthermalent: -843.397408 hartree
zpe.sumelectthermalfe: -843.457716 hartree
dipole: -4.9532 1.3341 0.0004
dipole: 5.1297
quadrupole: -116.3575 -105.2055 -119.7471
quadrupole: 27.8686 0.0034 -0.0001
quadrupole: -2.5875 8.5645 -5.9771 27.8686 0.0034 -0.0001
hfenergy: -843.6806026 hartree
pointgroup: C01 [X(C18H14O2)]
dipole: 1.9587472 0.4862025 -0.0001536 debye
polarizability: 402.303095|0.1340499|202.901631|-0.0079856|-0.0088135|88.4643877 unknown
InChI: InChI=1S/C18H14O2/c1-20-12-3-5-13-11(10-12)2-4-15-14(13)6-7-17-16(15)8-9-18(17)19/h2-7,10H,8-9H2,1H3
charge 0 multiplicity 1
34 atoms
O  -5.399125 -1.478058 0.000361
O  5.436398 0.256817 -0.000135
C  -2.476016 0.603475 0.00004
C  -3.521291 1.715053 0.000027
C  -1.055421 0.734747 -0.000004
C  -3.077372 -0.666568 0.000146
C  -4.887292 0.970332 -0.000034
C  -0.247471 -0.465484 0.000063
C  -4.556338 -0.539951 0.000144
C  1.209725 -0.335221 0.000013
C  -2.296398 -1.855561 0.00023
C  -0.903539 -1.743993 0.000184
C  -0.41745 2.032988 -0.000105
C  1.808302 0.982055 -0.00009
C  0.957829 2.15307 -0.000145
C  2.091921 -1.456603 0.000061
C  3.222401 1.125513 -0.000136
C  4.059068 -0.001725 -0.000083
C  3.485014 -1.309461 0.000015
C  6.35047 -0.889527 -0.000052
H  -3.410143 2.367575 0.88674
H  -3.410081 2.36768 -0.886598
H  -5.503603 1.204871 -0.886746
H  -5.50386 1.205093 0.886434
H  -2.79516 -2.830207 0.000321
H  -0.305338 -2.659632 0.000244
H  -1.048676 2.928346 -0.000147
H  1.432932 3.140889 -0.000221
H  1.686152 -2.472345 0.000133
H  3.677412 2.121304 -0.000212
H  4.118801 -2.200971 0.000052
H  6.216012 -1.512572 -0.905542
H  6.216018 -1.512436 0.905533
H  7.358217 -0.449396 -0.000089
