program: Gaussian 09
title: 000189169
version: EM64L-G09RevD.01
frameworkgroup: C1[X(C15H21N3O8S2)]
method: RPBEPBE
basis: SDD
operation: Freq
keyword: #p
keyword: freq=noraman
keyword: PBEPBE/SDD
title: #p freq=noraman PBEPBE/SDD
converged: YES YES NO NO
title: Mulliken charges:
elementType: S S O O O O O O O O N N N C C C C C C C C C C C C C C C H H H H H H H H H H H H H H H H H H H H H
charge: 0.133662 0.196760 -0.377242 -0.373656 -0.426269 -0.243783 -0.406476 -0.433007 -0.257698 -0.223064 -0.653047 -0.563630 -0.667942 -0.648062 0.675619 -0.122764 -0.667034 -0.446285 -0.425253 0.302228 0.209251 -0.638337 -0.166741 -0.694235 0.211909 -0.080543 0.212334 0.197926 0.242791 0.250418 0.251799 0.257278 0.272477 0.305062 0.268574 0.284239 0.286144 0.296146 0.320411 0.275622 0.347819 0.356044 0.289366 0.300776 0.300284 0.327065 0.379968 0.379867 0.383229
chargesum: 0.00000
title: Mulliken charges with hydrogens summed into heavy atoms:
elementType: S S O O O O O O O O N N N C C C C C C C C C C C C C C C
charge: 0.133662 0.196760 -0.029422 -0.017612 -0.046301 -0.243783 -0.026609 -0.049778 -0.257698 -0.223064 -0.036491 0.026512 -0.040593 -0.154854 0.675619 0.129035 -0.667034 -0.189006 -0.425253 0.302228 0.209251 -0.060799 0.101832 -0.123852 0.211909 0.195079 0.212334 0.197926
polarizability: 3.41953401e+02 4.10535313e+00 2.49914854e+02 -1.63639356e+01 3.39764977e+00 1.88190152e+02
1716.lowfreq: -9.0548 -4.4267 -0.0015 -0.0014 -0.0003 7.2420 13.4691 26.3639 29.7136
frequency: 13.3810 26.3036 29.6593 33.0015 38.8253 41.4988 48.7785 53.4812 62.5886 68.4853 76.3392 81.1191 95.5657 109.6069 115.3532 133.6047 154.8726 168.7557 202.6487 229.9052 240.6792 246.3925 254.7888 261.3301 272.5655 280.8767 295.4141 302.6361 312.8584 318.8202 323.2326 324.3582 339.3198 360.4981 363.6363 382.5333 386.1129 405.6277 458.0214 467.3485 481.0130 491.9789 511.4206 523.4675 534.6547 548.8370 568.7821 571.4242 577.7291 581.4997 587.2916 602.9699 603.5470 619.9088 622.3255 650.3290 659.4734 668.7777 687.1505 698.0732 705.5719 719.7631 746.7435 760.9394 766.9310 778.6646 784.5512 801.1922 864.0328 876.6289 909.4746 924.4243 945.1051 995.8906 1000.5653 1011.5046 1013.9222 1049.1298 1052.5233 1057.2649 1102.0783 1107.0141 1109.9536 1114.4279 1118.1330 1169.2291 1174.2961 1190.8195 1197.2945 1210.7620 1224.0244 1233.3008 1241.1376 1252.9134 1262.5669 1267.5071 1270.6286 1277.9166 1282.7919 1303.0374 1312.9961 1334.2274 1349.2934 1364.3474 1380.2902 1381.4929 1389.5832 1407.0818 1425.9838 1438.2903 1464.1180 1471.8852 1563.0188 1605.3575 1632.7017 1639.4722 1645.3274 1653.7064 1659.3827 1672.4797 2846.9829 2857.9296 3002.5285 3049.3290 3055.5655 3060.0188 3072.4013 3135.0689 3136.3661 3154.9232 3348.6412 3356.4268 3442.6162 3452.0142 3482.4252 3503.2041 3513.5698 3517.3683 3583.9618 3592.1428 3619.7749
redmass: 7.9372 7.5967 7.5024 6.8933 6.8286 8.5257 7.6878 7.0718 9.4870 6.0470 6.0887 7.0838 5.7876 7.1944 6.9820 8.0784 4.7963 5.1078 10.0729 5.2192 4.1912 3.8660 3.7387 5.0404 3.9342 3.2992 1.7285 2.7491 3.5583 3.2320 3.6922 4.8279 4.2841 3.4600 3.2584 1.8462 1.2616 3.0356 7.4047 3.9790 3.7289 3.9047 4.1609 4.4140 1.3318 5.3346 3.8419 3.1696 1.1062 2.4966 1.5280 1.3632 1.4987 4.3633 1.4664 4.8323 3.0980 1.6913 3.3622 2.6363 3.2706 4.2256 1.9660 5.6980 3.4266 3.1158 2.0632 4.6106 1.6039 8.3147 2.0625 1.5295 2.2101 3.8180 3.0512 4.7189 5.0408 2.1790 2.1598 2.2354 1.3411 2.2700 2.4508 2.3167 2.6371 1.1868 1.2085 1.3917 1.5173 1.4008 1.3845 1.7666 1.4748 1.1802 1.6885 1.4138 1.6798 1.5164 2.0912 1.3374 1.6285 1.6993 1.7335 1.3343 2.0924 1.9703 5.0907 2.7324 1.1035 1.0999 1.1019 4.0770 8.1995 6.1477 1.2132 1.4047 2.4245 1.7850 2.0889 9.2128 1.0776 1.0786 1.0627 1.0624 1.0577 1.0807 1.0995 1.1078 1.1081 1.0918 1.0636 1.0641 1.0472 1.0460 1.0446 1.0641 1.0641 1.0641 1.0971 1.0983 1.1004
irintensity: 0.2890 0.5016 0.1140 0.4643 0.6334 1.8040 0.4893 1.1387 3.9307 0.7076 0.5881 1.3303 0.6483 0.7282 0.2747 0.0034 0.1248 0.2831 2.7941 2.2062 2.6019 0.9672 4.4146 3.7936 1.2223 20.2569 30.8260 23.3840 3.2698 13.3161 7.0443 26.9828 21.9665 3.5826 6.6682 43.7587 14.4835 58.9279 6.8108 33.7039 26.7444 37.5769 8.5996 10.5807 249.1141 4.0587 14.2758 61.9056 7.3778 10.4691 185.3653 37.1400 61.5898 5.9198 107.5188 39.7036 30.5571 194.8617 65.7336 257.1247 2.4495 40.8607 123.5891 5.3921 5.4601 2.1430 43.7856 26.2470 15.1207 1.4373 5.1122 10.9946 5.0323 32.1440 107.2366 126.4500 45.1645 146.1299 367.1339 300.8488 19.9793 13.3593 6.0492 22.2566 8.5049 6.8131 3.4252 500.9000 28.4944 9.5259 6.5576 44.9096 10.3844 14.5518 20.0687 15.0539 31.7618 0.7180 34.4810 11.7438 8.0924 6.3065 13.3926 6.3898 8.6155 24.0394 47.2505 29.1858 24.4962 9.2260 18.7810 57.6220 20.6028 4.2352 65.8402 39.1123 227.5468 229.0741 60.0257 159.0283 42.3745 29.6927 11.4855 4.1032 8.8695 9.2360 8.9717 1.9330 3.3614 2.2776 113.9517 70.7006 50.9471 24.8721 10.5194 27.3279 22.8375 26.5124 50.1399 33.2863 10.0026
temp: 298.150 k
press: 1.00000 atm
elementType: 16 16 8 8 8 8 8 8 8 8 7 7 7 6 6 6 6 6 6 6 6 6 6 6 6 6 6 6 1 1 1 1 1 1 1 1 1 1 1 1 1 1 1 1 1 1 1 1 1
symmnumber: 1
zpe: 960723.5 jmol-1
zpe.correction: 0.365920 hartree
zpe.thermalcorrener: 0.396864 hartree
zpe.thermalcorrenthalpy: 0.397808 hartree
zpe.thermalcorrgfe: 0.300792 hartree
zpe.sumelectzpe: -2144.222169 hartree
zpe.sumelectthermal: -2144.191225 hartree
zpe.sumelectthermalent: -2144.190281 hartree
zpe.sumelectthermalfe: -2144.287297 hartree
dipole: 6.9913 3.9336 -1.8151
dipole: 8.2247
quadrupole: -145.1628 -183.9236 -177.5098
quadrupole: -11.7507 10.4196 -11.3213
quadrupole: 23.7026 -15.0582 -8.6444 -11.7507 10.4196 -11.3213
hfenergy: -2144.5880896 hartree
pointgroup: C01 [X(C15H21N3O8S2)]
dipole: -2.6309229 1.4726342 1.1748667 debye
polarizability: 339.8585793|-4.187283|248.4135204|-23.3456347|11.7734027|191.786307 unknown
InChI: InChI=1S/C15H21N3O8S2/c16-6(13(21)22)1-5-2-9(27-3-7(17)14(23)24)10(19)11(20)12(5)28-4-8(18)15(25)26/h2,6-8,19-21,23,25H,1,3-4,16-18H2
charge 0 multiplicity 1
49 atoms
S  -2.311149 -1.119445 1.058276
S  3.344415 -1.26192 -2.141123
O  -0.266505 -3.352421 0.953418
O  2.148269 -3.39806 -0.308627
O  -0.001736 3.884541 1.805895
O  1.283546 2.619442 0.359734
O  -6.079088 0.416023 1.501754
O  5.75478 -0.255396 1.975763
O  -4.641884 1.252207 -0.120539
O  6.235088 -1.231544 -0.073503
N  -2.232645 3.222367 0.405159
N  -5.911761 -1.586225 -0.975183
N  4.257127 1.638107 0.661152
C  -1.153589 1.331291 -0.744855
C  -0.327162 0.058554 -0.66164
C  -1.178311 2.202385 0.544015
C  -0.72397 -1.075753 0.104402
C  0.888295 -0.029533 -1.373511
C  1.71657 -1.166819 -1.276654
C  0.092068 -2.237065 0.202995
C  1.342966 -2.276389 -0.47705
C  -3.537322 -1.521687 -0.355697
C  -4.973763 -1.217452 0.097763
C  4.154183 0.28483 -1.383602
C  0.157262 2.885199 0.834922
C  4.248968 0.253938 0.15686
C  -5.153386 0.268815 0.465939
C  5.505714 -0.487479 0.612608
H  -2.214887 1.095372 -0.948608
H  -0.798281 1.961627 -1.577916
H  -1.338655 1.510034 1.410434
H  1.205879 0.822673 -1.980957
H  -3.246827 -0.896815 -1.215858
H  -3.449861 -2.586197 -0.615548
H  -5.22273 -1.816785 0.990002
H  5.147586 0.34631 -1.854644
H  3.548233 1.14932 -1.692163
H  -2.249098 3.91225 1.161047
H  -3.148849 2.814236 0.187926
H  3.390813 -0.347689 0.54983
H  -1.143511 -3.151868 1.395819
H  3.017471 -3.225851 -0.777522
H  -5.818578 -1.052097 -1.843402
H  -6.878188 -1.748971 -0.684859
H  4.647918 1.728642 1.603181
H  3.352064 2.110199 0.543932
H  0.876825 4.313713 1.992679
H  -6.249559 1.381903 1.67649
H  6.562754 -0.766114 2.253468
