program: Gaussian 09
title: 000196978
version: EM64L-G09RevD.01
frameworkgroup: C1[X(C14H8O4)]
method: RPBEPBE
basis: SDD
operation: Freq
keyword: #pfreq=noraman
keyword: PBEPBE/SDD
title: #p freq=noraman PBEPBE/SDD
converged: NO NO NO YES
title: Mulliken charges:
elementType: O O O O C C C C C C C C C C C C C C H H H H H H H H
charge: -0.374117 -0.171178 -0.202258 -0.419896 0.131815 0.350864 0.255281 0.265271 -0.153335 -0.216128 0.218051 -0.610783 -0.374078 -0.370910 0.361216 -0.571963 -0.224311 -0.229724 0.291136 0.292472 0.288192 0.252453 0.239145 0.239635 0.363035 0.370115
chargesum: 0.00000
title: Mulliken charges with hydrogens summed into heavy atoms:
elementType: O O O O C C C C C C C C C C C C C C
charge: -0.011083 -0.171178 -0.202258 -0.049780 0.131815 0.350864 0.255281 0.265271 -0.153335 -0.216128 0.218051 -0.319647 -0.081606 -0.082719 0.361216 -0.319509 0.014834 0.009911
polarizability: 2.71635496e+02 -6.66502610e+00 1.95832161e+02 2.98662034e-04 4.50463685e-04 6.13884839e+01
1716.lowfreq: -2.5764 -0.0007 0.0000 0.0003 5.1672 7.2840 40.8235 58.2781 118.8805
frequency: 40.8230 58.2771 118.8805 145.4871 183.9706 198.0302 212.1942 273.0002 295.3736 298.9829 346.3016 371.9415 383.8100 406.8912 417.1468 428.1498 450.2201 459.4607 483.3203 526.7566 533.6425 571.9490 615.2117 639.8747 654.5387 672.8820 715.3960 723.3938 738.2241 810.6021 836.6858 846.2598 860.4580 891.2541 900.2031 943.7607 994.1573 999.3191 1008.1701 1016.1107 1041.0927 1082.6525 1114.7747 1152.3784 1164.0971 1174.0441 1184.3693 1213.6692 1248.4386 1279.7232 1286.9782 1344.4719 1396.6798 1423.0152 1432.4342 1445.9327 1469.2424 1475.0434 1535.0114 1547.0458 1586.6966 1593.6692 1612.6797 1626.3505 3133.8089 3135.1401 3139.7085 3150.6762 3162.2015 3171.0669 3541.6707 3584.9649
redmass: 8.3513 7.6168 4.8298 8.5686 6.2423 6.1179 4.4616 6.1761 6.7649 4.8238 10.1244 7.2987 10.5924 1.1402 2.5388 1.6450 2.6994 11.3754 5.9935 4.4781 7.2491 7.2580 4.7402 6.2397 3.3675 5.9973 7.6039 3.6920 2.3388 1.8498 7.9267 1.6937 2.2271 6.6100 1.5704 2.1857 4.6623 1.3934 5.0630 1.3657 2.0406 2.8330 2.2124 1.2546 1.6428 1.2748 1.2987 2.1020 1.6698 2.3382 4.0128 5.9546 9.9819 7.3236 2.7626 3.0748 2.6859 3.8990 10.1844 9.3702 7.0392 6.9919 7.0949 6.8316 1.0919 1.0863 1.0923 1.0902 1.0944 1.1001 1.0657 1.0661
irintensity: 7.9549 0.0024 0.1044 0.8865 2.5534 0.0000 1.9283 4.7607 4.0955 5.7136 4.3460 17.9732 13.0788 62.2359 33.6731 135.2511 48.7683 0.7098 5.9261 4.5250 0.2496 22.6152 4.9603 5.6803 13.8051 2.3990 8.9002 27.1842 45.4136 25.3318 31.3633 30.5015 5.5165 11.1065 26.7243 2.2238 69.7297 4.9483 38.1327 0.1251 10.3477 7.2476 239.8301 181.4111 17.0193 14.5128 35.1119 25.2630 32.1512 11.6408 495.4809 291.4743 0.0095 3.6206 4.4435 18.8520 3.7423 2.5996 70.3542 346.8671 36.8722 56.7381 31.0697 123.9791 7.9071 4.3116 5.4177 7.0293 1.5071 30.6772 34.3800 77.6412
temp: 298.150 k
press: 1.00000 atm
elementType: 8 8 8 8 6 6 6 6 6 6 6 6 6 6 6 6 6 6 1 1 1 1 1 1 1 1
symmnumber: 1
zpe: 481621.6 jmol-1
zpe.correction: 0.183440 hartree
zpe.thermalcorrener: 0.197243 hartree
zpe.thermalcorrenthalpy: 0.198187 hartree
zpe.thermalcorrgfe: 0.142942 hartree
zpe.sumelectzpe: -837.968161 hartree
zpe.sumelectthermal: -837.954358 hartree
zpe.sumelectthermalent: -837.953414 hartree
zpe.sumelectthermalfe: -838.008659 hartree
dipole: 1.3908 -1.2139 -0.0020
dipole: 1.8460
quadrupole: -73.7708 -106.1444 -105.3691
quadrupole: 1.2163 0.0003 -0.0048
quadrupole: 21.3239 -11.0497 -10.2743 1.2163 0.0003 -0.0048
hfenergy: -838.1516005 hartree
pointgroup: C01 [X(C14H8O4)]
dipole: 0.5452486 -0.4797928 -0.0007882 debye
dipolederiv: -0.0858726 -0.1685917 0.0000385 -0.5135565 -1.2481971 0.0001787 0.0001448 0.0001958 -0.3695895 -0.6646862 0.0619751 0.0000303 0.2225068 -0.8521928 0.0000243 0.0001438 -0.0004642 -0.2980413 -0.6949808 0.0079569 -0.0000043 0.004799 -0.9570544 -0.0001398 -0.0000106 0.0002647 -0.3115652 -1.3613679 0.6814521 -0.0001419 0.7526884 -0.4946539 0.0000824 -0.0002142 0.0001139 -0.4190088 -0.9953357 0.0761597 0.0000578 0.5046409 -0.3873864 -0.0000257 -0.0001335 -0.0001014 -0.0590295 -0.3422514 -0.3951347 0.0000158 -0.634724 0.1601209 -0.0000101 -0.0002682 0.0001009 0.0621202 -0.3633648 -0.1810066 -0.0000338 -0.4080123 -0.0872394 -0.0000449 0.0002624 -0.0001552 0.0243523 -0.6292823 0.2447184 0.0000052 0.369578 -0.1315984 -0.0000026 0.0001958 0.0001635 0.014896 1.8159364 -0.0307237 -0.0000288 -0.2607521 0.8769777 0.0002022 -0.0003063 0.0003769 0.1465635 1.7071091 0.0090775 0.0000186 -0.0128201 0.9894897 0.0000523 0.0000698 -0.0002616 0.123856 0.3672508 0.01028 0.0000054 0.5139542 1.2627939 -0.0002733 -0.0000471 -0.0002412 0.1222453 -0.792933 0.3740583 -0.0000352 -0.1576069 -0.0760504 -0.0000116 -0.000139 0.0000319 -0.1935717 -0.2761793 0.0852923 -0.0000014 -0.1169046 0.0901631 -0.0000196 0.0000089 0.0000562 -0.1107266 -0.1083037 -0.1565535 -0.0000136 0.1083811 0.0851627 0.0000042 0.0000349 -0.000016 -0.1061538 1.5505192 -0.6807969 0.0002 -0.471109 0.5917399 -0.0001431 0.0002979 -0.0001768 0.1244436 -0.1008965 0.287918 -0.0000397 0.1776814 -0.5001691 0.0000968 -0.0000172 0.000092 -0.2151605 0.1929542 -0.1205234 -0.0000443 -0.0515954 0.0102327 0.0000192 -0.0000687 0.0000346 -0.1374322 0.1303394 0.1598821 -0.0000379 0.0862371 -0.0739827 -0.0000212 -0.0000348 -0.000039 -0.1475698 0.1248782 0.0021281 -0.0000062 0.0709226 0.00631 0.0000204 -0.000013 0.0000275 0.1782354 0.1514523 -0.0354482 0.0000067 0.0396678 0.0065059 0.0000058 0.0000615 -0.0000209 0.1552238 0.1261436 0.0360875 0.0000022 -0.0339501 -0.0054258 -0.0000038 -0.0000011 0.0000155 0.1555343 -0.0045901 -0.0575724 -0.0000058 -0.1012044 0.0263493 0.0000065 -0.0000123 0.000012 0.1835223 -0.086232 0.077993 0.0000197 0.0926462 0.0490444 -0.0000146 0.0000235 -0.0000291 0.1555605 -0.0822636 -0.0805431 0.0000181 -0.0972588 0.0454985 0.0000115 0.0000357 0.0000247 0.1581167 0.0509264 -0.0257108 -0.0000305 0.1147968 0.4197955 -0.0000017 -0.0000324 0.0000028 0.3738599 0.3710302 -0.1823742 0.0000051 -0.1990063 0.193766 0.0000074 0.0000197 -0.0000075 0.3893191 unknown
polarizability: 271.5804966|-6.9705571|195.8871606|0.0003005|0.0004493|61.3884839 unknown
InChI: InChI=1S/C14H8O4/c15-7-5-10-12(11(16)6-7)14(18)9-4-2-1-3-8(9)13(10)17/h1-6,15-16H
charge 0 multiplicity 1
26 atoms
O  2.173398 2.739429 -0.000813
O  -0.510142 2.709437 0.000689
O  -0.37896 -2.814991 -0.000076
O  4.528808 -1.456492 0.000069
C  0.85196 0.692249 -0.00066
C  0.860644 -0.741051 -0.000589
C  -1.705725 0.627003 -0.000585
C  -1.69799 -0.795505 -0.000633
C  -0.435279 1.440468 -0.000726
C  -0.412918 -1.542661 -0.000816
C  2.128463 1.350245 -0.000568
C  2.060179 -1.48046 -0.000337
C  -2.943793 1.314756 -0.00037
C  -2.921229 -1.51367 -0.000466
C  3.296498 -0.799774 -0.000194
C  3.33156 0.607793 -0.000341
C  -4.157494 0.597613 -0.000255
C  -4.147552 -0.821483 -0.000297
H  1.989402 -2.574718 -0.000259
H  -2.923302 2.409059 -0.000293
H  -2.879175 -2.607372 -0.000461
H  4.306148 1.11066 -0.000289
H  -5.110578 1.137724 -0.000135
H  -5.091666 -1.376631 -0.00019
H  3.113816 3.054696 -0.00078
H  4.40833 -2.438526 0.000171
