program: Gaussian 09
title: 000197033
version: EM64L-G09RevD.01
frameworkgroup: C1[X(C21H25N3)]
method: RPBEPBE
basis: SDD
operation: Freq
keyword: #pfreq=noraman
keyword: PBEPBE/SDD
title: #p freq=noraman PBEPBE/SDD
converged: YES YES NO NO
title: Mulliken charges:
elementType: N N N C C C C C C C C C C C C C C C C C C C C C H H H H H H H H H H H H H H H H H H H H H H H H H
charge: -0.214511 -0.079637 -0.024247 0.188158 0.096388 -0.470066 -0.465338 0.161683 -0.388137 0.219572 -0.464125 -0.624220 -0.370406 -0.572651 -0.623759 0.462743 -0.369047 0.525857 -0.829534 -0.333982 -0.557185 -0.294883 0.155577 -0.771816 0.198978 0.237231 0.230943 0.191040 0.191807 0.216374 0.238797 0.246347 0.236055 0.229200 0.223335 0.239564 0.226678 0.187124 0.225234 0.223380 0.221118 0.225378 0.224431 0.238875 0.247976 0.234728 0.254984 0.226560 0.227431
chargesum: 0.00000
title: Mulliken charges with hydrogens summed into heavy atoms:
elementType: N N N C C C C C C C C C C C C C C C C C C C C C
charge: -0.214511 -0.079637 -0.024247 0.188158 0.096388 -0.033858 -0.043355 0.161683 0.020044 0.219572 0.021019 -0.388165 -0.141206 -0.109753 0.015277 0.462743 -0.145667 0.525857 -0.158608 -0.095106 -0.309209 -0.060155 0.155577 -0.062842
polarizability: 3.30271284e+02 1.81215961e+01 2.98501852e+02 1.91843412e+01 2.52544665e+00 1.36150410e+02
1716.lowfreq: -13.0620 -7.9418 -4.7193 -0.0008 -0.0002 0.0007 2.6439 14.3895 19.7980
frequency: -12.9026 14.2559 19.7875 29.4058 49.3921 60.2256 66.4975 72.2475 90.7338 119.8643 157.7751 164.5542 176.6884 204.6539 232.1953 245.5295 264.5850 286.8025 305.1620 312.8459 320.3770 345.9993 359.3076 370.4092 377.5913 389.6767 410.3528 432.8498 453.4012 493.5784 513.2978 527.0220 567.6284 580.9602 600.5213 635.3745 638.3100 663.0706 703.7826 741.3959 743.0298 754.9109 765.1367 775.0408 782.2511 794.6658 827.3083 846.7102 851.2995 878.9094 894.5888 929.9634 931.1505 965.4545 969.2258 973.1044 975.3170 990.3256 1003.6262 1007.2786 1014.0004 1027.4433 1038.3493 1046.9425 1047.6179 1049.2812 1062.5209 1114.0160 1133.1429 1136.5765 1144.4957 1162.1502 1174.1776 1182.7876 1195.1243 1215.5180 1222.3892 1239.4840 1247.8137 1250.8446 1279.2898 1285.2562 1287.8010 1296.7748 1309.8495 1311.7403 1313.8385 1343.9825 1349.5467 1365.8814 1374.7540 1378.5686 1390.9048 1398.5794 1404.4970 1429.6774 1433.0796 1449.3197 1455.7021 1463.1414 1463.8157 1464.3918 1470.4396 1470.7839 1471.5255 1475.6964 1479.8696 1481.7964 1482.5890 1487.3238 1495.3649 1554.3633 1579.5853 1594.8774 1601.1834 1633.4672 2801.4745 2837.5410 2854.6809 2959.5603 2970.3169 2982.8043 2987.1175 2994.2176 3007.2284 3008.4573 3016.5511 3035.4287 3045.8574 3046.1826 3060.2582 3072.1671 3075.4665 3077.6726 3106.0712 3114.8797 3116.4314 3117.5236 3121.6959 3139.9743 3147.7946
redmass: 1.0420 4.2382 4.2304 4.0987 3.6282 1.1586 2.9855 3.5587 2.8366 3.9014 3.5410 3.9464 2.5300 2.5586 1.3330 1.7328 3.2446 2.6227 2.5899 2.8717 3.1116 4.0308 2.9478 2.9818 2.8519 4.1951 3.2523 2.8665 4.1559 3.6209 3.3428 3.9684 4.3261 3.5798 3.6419 7.6259 5.0372 5.0813 4.9642 2.7521 3.5030 4.1064 2.7619 3.1370 1.5109 1.4070 3.1129 2.6520 2.1033 1.3985 2.4040 1.3378 1.4719 2.2873 1.7675 1.6218 1.4128 1.6449 3.4682 3.2242 1.9612 2.9212 2.1292 1.5799 1.7760 1.5882 1.9529 1.3305 1.8850 1.5294 1.4870 1.6242 1.3654 1.4618 1.5526 2.4838 3.0176 1.6457 2.1851 2.0982 1.5819 1.4064 1.3924 1.5909 1.7465 5.2142 1.5798 1.6102 1.4374 1.8093 1.9681 2.0197 1.2576 1.2576 4.9829 2.9869 1.2456 1.1987 1.2328 1.1383 1.1569 1.3655 1.0482 1.0465 1.2366 1.7239 1.4113 1.9224 1.2061 1.1660 1.8528 5.1985 6.5352 6.3473 7.9117 7.2932 1.0719 1.0674 1.0607 1.0586 1.0372 1.0382 1.0845 1.0601 1.0631 1.0968 1.0718 1.0893 1.1015 1.0977 1.0973 1.1053 1.1009 1.0983 1.0913 1.0868 1.0919 1.0951 1.0916 1.0967 1.0969
irintensity: 0.2973 0.4210 0.9732 0.2968 0.4468 0.6987 0.2184 0.3817 0.4251 0.1378 2.5539 1.8166 4.6805 0.7004 0.1804 0.5035 3.6300 2.6025 6.3670 0.5847 2.0441 0.6393 1.8395 0.4114 3.8854 5.0147 3.4875 4.6441 0.2700 11.7618 5.9070 2.9774 1.4235 4.3687 4.3003 1.0853 0.8595 10.0276 3.6638 7.7877 1.9775 2.3857 8.6160 6.0440 0.4996 45.3164 7.0432 5.4029 12.0939 7.6451 4.5334 0.4532 0.8865 10.9406 3.4783 3.3561 1.0713 1.3068 7.9028 11.4585 9.8633 9.6162 0.6533 8.7482 17.6065 9.1332 5.9114 8.1288 19.2785 13.3356 13.4447 21.2950 16.3613 1.1587 2.0476 8.0003 2.4631 7.4655 1.1684 16.4741 4.1650 2.5324 5.4161 4.0978 7.0300 2.8370 21.8298 62.3402 38.1765 30.3009 10.3025 15.0824 20.4566 2.7297 45.0311 68.6498 4.3543 0.9661 32.9704 5.5410 24.5529 10.9141 13.3535 11.2775 8.8659 53.6486 48.2790 39.4143 9.2623 21.9742 27.7902 9.1873 2.4135 10.2914 10.5208 9.8956 71.5349 53.4609 234.5208 63.1384 62.8574 26.1706 31.1075 6.4088 56.8860 30.1741 54.5469 55.4754 0.4698 25.5876 20.7650 16.5148 32.9375 20.6354 28.4317 9.6109 23.1049 5.2924 25.9532 23.8039 16.0039
temp: 298.150 k
press: 1.00000 atm
elementType: 7 7 7 6 6 6 6 6 6 6 6 6 6 6 6 6 6 6 6 6 6 6 6 6 1 1 1 1 1 1 1 1 1 1 1 1 1 1 1 1 1 1 1 1 1 1 1 1 1
symmnumber: 1
zpe: 1080160.2 jmol-1
zpe.correction: 0.411411 hartree
zpe.thermalcorrener: 0.433389 hartree
zpe.thermalcorrenthalpy: 0.434333 hartree
zpe.thermalcorrgfe: 0.357609 hartree
zpe.sumelectzpe: -977.746094 hartree
zpe.sumelectthermal: -977.724116 hartree
zpe.sumelectthermalent: -977.723172 hartree
zpe.sumelectthermalfe: -977.799896 hartree
dipole: -0.5157 -3.5071 0.6526
dipole: 3.6043
quadrupole: -137.7996 -132.9227 -149.4104
quadrupole: 9.9374 6.1296 -1.8367
quadrupole: 2.2446 7.1215 -9.3662 9.9374 6.1296 -1.8367
hfenergy: -978.157505 hartree
pointgroup: C01 [X(C21H25N3)]
dipole: 0.2346402 1.3766204 0.2464284 debye
polarizability: 330.7916611|17.264748|297.690102|-20.6021053|-3.2490451|136.4417838 unknown
InChI: InChI=1S/C21H25N3/c1-15-4-7-20-18(12-15)19-14-23(3)10-9-21(19)24(20)11-8-17-6-5-16(2)22-13-17/h4-7,12-13H,8-11,14H2,1-3H3
charge 0 multiplicity 1
49 atoms
N  -0.53951 0.054914 -0.430732
N  -3.472365 3.032829 -0.226731
N  5.302173 -1.189546 0.095602
C  -1.4026 1.157375 -0.256869
C  -2.695606 0.707375 -0.007032
C  -1.013404 2.60517 -0.34673
C  -3.850557 1.654652 0.188703
C  -2.659112 -0.739203 -0.00312
C  -2.147333 3.446672 0.292983
C  -1.294412 -1.12099 -0.264924
C  0.909206 0.110989 -0.630181
C  -3.635233 -1.753274 0.185859
C  -0.903429 -2.475241 -0.331628
C  1.712574 0.024267 0.706165
C  -4.536941 4.004566 0.07902
C  -3.26309 -3.113393 0.119967
C  -1.897192 -3.45567 -0.138008
C  3.208797 0.054901 0.46353
C  -4.289716 -4.218047 0.31761
C  3.919537 1.271005 0.288044
C  3.963226 -1.140233 0.355891
C  5.302751 1.242338 0.020892
C  5.974019 -0.007027 -0.074609
C  7.459294 -0.092153 -0.360285
H  -0.061164 2.815708 0.182327
H  -0.881367 2.915196 -1.402803
H  -4.722011 1.340718 -0.419752
H  -4.186649 1.634323 1.261236
H  -2.088359 3.348908 1.408671
H  -2.000045 4.514021 0.045899
H  1.163976 1.050009 -1.153514
H  1.214632 -0.718419 -1.294385
H  -4.680337 -1.484848 0.38325
H  0.133197 -2.769136 -0.531717
H  1.405163 0.866611 1.354469
H  1.424704 -0.907734 1.226869
H  -4.27265 4.994201 -0.33459
H  -4.730373 4.125836 1.176075
H  -5.480655 3.678785 -0.394977
H  -1.618856 -4.515842 -0.187316
H  -5.295028 -3.804471 0.510015
H  -4.360617 -4.868886 -0.574894
H  -4.025602 -4.868715 1.173202
H  3.394042 2.230635 0.371621
H  3.473262 -2.113531 0.494071
H  5.86703 2.172024 -0.11018
H  7.765251 -1.148964 -0.396544
H  7.711987 0.384498 -1.325929
H  8.049195 0.420693 0.422476
