program: Gaussian 09
title: 000196975
version: EM64L-G09RevD.01
frameworkgroup: C1[X(C9H6FN)]
method: RPBEPBE
basis: SDD
operation: Freq
keyword: #pfreq=noraman
keyword: PBEPBE/SDD
title: #p freq=noraman PBEPBE/SDD
converged: NO YES NO YES
title: Mulliken charges:
elementType: F N C C C C C C C C C H H H H H H
charge: -0.202532 -0.018418 0.449672 -0.068457 -0.532086 -0.303990 -0.263290 0.326199 -0.360743 -0.176646 -0.363293 0.261672 0.247553 0.267425 0.261154 0.232552 0.243228
chargesum: 0.00000
title: Mulliken charges with hydrogens summed into heavy atoms:
elementType: F N C C C C C C C C C
charge: -0.202532 -0.018418 0.449672 -0.068457 -0.270414 -0.056437 0.004135 0.326199 -0.099589 0.055906 -0.120065
polarizability: 1.56950182e+02 -7.27668748e+00 1.05364490e+02 1.99709688e-03 1.71296510e-03 3.99510179e+01
1716.lowfreq: -13.5814 -10.4625 -0.0007 0.0005 0.0008 8.7727 122.7931 172.6207 281.6434
frequency: 122.7929 172.6204 281.6431 298.4672 404.9837 407.9241 444.4053 476.2692 526.6087 532.5485 607.4398 641.6460 699.7742 748.1109 777.4226 799.6418 839.1815 877.4342 890.2011 940.0334 943.8989 969.2736 988.5637 1028.3472 1103.8226 1131.5874 1142.8082 1221.3891 1242.0228 1248.7027 1349.2163 1351.8563 1397.1086 1424.7378 1457.0302 1498.1783 1556.2398 1594.3216 1629.5308 3124.9344 3135.0226 3157.0025 3162.9346 3167.9714 3183.4483
redmass: 6.7279 4.1272 7.6409 5.2333 3.5768 7.2975 6.1534 2.8098 6.6200 4.0309 7.6124 2.8634 7.1391 5.2061 1.8848 1.3720 1.9796 1.6220 5.9267 1.4353 3.8834 1.3347 1.3769 2.5494 1.7061 1.4545 1.3778 1.8329 1.8510 2.4220 4.0956 1.8925 3.2396 2.7435 3.3080 4.1012 7.2373 6.3625 7.2210 1.0890 1.0909 1.0930 1.0883 1.0992 1.0984
irintensity: 0.3380 5.4403 2.1105 2.4058 1.6641 2.2476 7.0015 13.5603 0.9894 1.1953 5.3341 0.3715 13.3752 0.8969 1.5626 21.0977 50.7073 65.9674 18.0912 0.5266 15.4134 0.5949 2.2989 1.2084 15.2628 14.3831 22.9664 0.5669 37.7917 17.8591 14.9901 4.3239 3.7384 0.6196 23.0142 71.7004 18.9448 9.8911 29.9474 14.2505 11.7377 4.3063 0.4004 25.1362 4.0495
temp: 298.150 k
press: 1.00000 atm
elementType: 9 7 6 6 6 6 6 6 6 6 6 1 1 1 1 1 1
symmnumber: 1
zpe: 327173.3 jmol-1
zpe.correction: 0.124614 hartree
zpe.thermalcorrener: 0.132350 hartree
zpe.thermalcorrenthalpy: 0.133294 hartree
zpe.thermalcorrgfe: 0.091997 hartree
zpe.sumelectzpe: -500.401832 hartree
zpe.sumelectthermal: -500.394096 hartree
zpe.sumelectthermalent: -500.393151 hartree
zpe.sumelectthermalfe: -500.434448 hartree
dipole: 1.3906 -1.5681 0.0000
dipole: 2.0959
quadrupole: -61.7289 -57.3419 -65.9919
quadrupole: -8.4732 -0.0003 0.0001
quadrupole: -0.0413 4.3457 -4.3044 -8.4732 -0.0003 0.0001
hfenergy: -500.5264454 hartree
pointgroup: C01 [X(C9H6F1N1)]
dipole: 0.5482598 -0.6159165 0.0000162 debye
dipolederiv: -1.1700078 -0.1819323 -0.000035 -0.3498337 -0.2744284 -0.0000147 -0.0000355 -0.000009 -0.1516482 -0.2711596 0.0057018 0.0000034 0.05809 -0.3197119 -0.0000013 0.0000057 -0.0000011 -0.2370753 0.1264627 0.0058986 0.0000057 0.1538803 -0.1897068 -0.0000016 0.0000137 -0.000006 0.0800138 0.1551317 0.0611625 -0.0000021 -0.1995968 -0.0231403 -0.0000048 -0.0000092 -0.0000018 0.0346801 -0.2973597 -0.0329826 -0.0000042 0.1406991 -0.0067822 0.0000083 -0.0000013 0.0000053 -0.1827473 0.1068327 0.0099062 0.0000037 -0.0363907 0.1932022 0.0000013 0.0000041 0.0000004 -0.1442727 0.0525556 -0.0345997 0.0000036 0.009696 0.1478614 0.0000107 0.0000057 0.0000109 -0.1261413 1.2675201 0.2578879 0.000044 0.4156009 0.3690006 0.0000224 0.0000478 0.0000179 0.1001982 -0.1749551 -0.0616427 -0.0000064 -0.2511777 -0.0468494 -0.0000009 -0.0000173 0.0000032 -0.1614987 -0.1308801 -0.1210798 -0.0000003 -0.2613192 -0.0811871 -0.0000047 0.0000019 -0.0000011 -0.1071374 0.2538537 0.0742816 -0.0000004 0.2635006 0.238707 0.0000099 -0.0000015 0.0000054 -0.0713842 0.075645 0.0046164 -0.0000032 -0.054919 -0.0370352 -0.000008 -0.0000073 -0.0000077 0.1853846 0.0798415 -0.0597177 -0.0000019 0.0024202 -0.083056 -0.000002 -0.0000031 -0.0000016 0.1466403 0.0937761 -0.0420709 -0.0000021 0.0075031 -0.0303505 -0.0000079 0.0000007 -0.0000082 0.1584291 0.0030896 0.0716758 -0.0000001 0.0655038 0.0535866 -0.0000048 0.0000004 -0.0000055 0.180473 -0.0487255 0.0975286 -0.0000021 0.1055541 0.0280682 -0.0000004 -0.0000022 0.0000015 0.1646835 -0.1216207 -0.0546337 -0.0000025 -0.069211 0.0618219 -0.0000016 -0.0000025 -0.0000027 0.1314026 unknown
polarizability: 156.9772061|-7.1802093|105.3374659|0.0019939|0.0017167|39.9510179 unknown
InChI: InChI=1S/C9H6FN/c10-8-3-4-9-7(6-8)2-1-5-11-9/h1-6H
charge 0 multiplicity 1
17 atoms
F  -3.479418 -0.71092 -0.000119
N  1.753045 1.301904 0.000055
C  0.233411 -0.675187 -0.000012
C  0.473512 0.757084 0.000025
C  -1.111416 -1.165125 -0.000064
C  1.377706 -1.539614 -0.000006
C  -0.64346 1.654723 0.000045
C  -2.150479 -0.243508 -0.000067
C  -1.950663 1.16573 -0.000001
C  2.656611 -0.9799 0.000021
C  2.794099 0.4468 0.000045
H  -1.322704 -2.239434 -0.000103
H  1.236438 -2.626494 -0.000015
H  -0.433351 2.727939 0.000095
H  -2.819371 1.8306 0.000017
H  3.552617 -1.608298 0.000028
H  3.792227 0.901198 0.000056
