program: Gaussian 09
title: 000196974
version: EM64L-G09RevD.01
frameworkgroup: C1[X(C9H6FN)]
method: RPBEPBE
basis: SDD
operation: Freq
keyword: #pfreq=noraman
keyword: PBEPBE/SDD
title: #p freq=noraman PBEPBE/SDD
converged: NO YES NO YES
title: Mulliken charges:
elementType: F N C C C C C C C C C H H H H H H
charge: -0.192951 -0.026824 0.225309 -0.025749 -0.353281 0.270908 -0.294036 -0.233821 -0.213737 -0.315014 -0.339418 0.260337 0.265381 0.234631 0.235060 0.256257 0.246947
chargesum: 0.00000
title: Mulliken charges with hydrogens summed into heavy atoms:
elementType: F N C C C C C C C C C
charge: -0.192951 -0.026824 0.225309 -0.025749 -0.092944 0.270908 -0.028656 0.000810 0.021323 -0.058757 -0.092471
polarizability: 1.50453253e+02 -1.00433412e+01 1.10118500e+02 1.35841283e-04 -5.85805650e-04 4.01475738e+01
1716.lowfreq: -0.0007 -0.0005 0.0001 9.2652 16.5574 17.3264 138.0021 175.2907 251.5892
frequency: 137.9917 175.2901 251.5867 253.9656 418.2971 454.7083 467.5166 472.1964 517.7270 554.4438 587.4481 637.4426 696.3726 779.5284 783.3127 803.9488 838.3721 839.6593 885.9443 942.9337 974.9428 1001.7183 1005.4840 1020.6596 1063.2029 1138.4154 1168.2679 1215.4660 1232.5872 1263.6151 1333.1611 1377.6796 1388.5555 1423.4320 1453.5829 1498.0734 1549.8469 1596.3694 1630.6652 3136.1900 3136.6105 3150.4677 3166.6630 3175.7805 3186.6531
redmass: 4.8665 4.2991 8.2235 6.3694 3.1769 6.8480 3.1365 6.5058 8.1799 7.6724 3.8974 3.4738 6.0080 1.3635 3.3479 5.6141 1.3300 6.7305 1.5731 1.4110 1.3617 1.3256 3.5836 2.0497 2.7106 1.4600 1.1541 2.0654 2.4054 1.6713 5.1154 1.8314 3.0561 3.1509 2.7689 4.0542 7.0413 6.8656 7.3640 1.0863 1.0905 1.0898 1.0958 1.0999 1.0955
irintensity: 0.7593 6.6514 2.3327 0.9753 7.3411 6.9645 0.9244 1.1422 0.6639 1.8043 3.0878 1.5825 12.9904 75.9151 3.9163 1.2656 63.3328 21.9988 0.8563 0.3527 3.0921 0.0182 18.1418 6.6617 16.2626 0.0145 2.5050 1.4348 22.1777 4.2856 5.9017 31.1081 18.8153 23.6141 4.9035 65.6214 24.9521 39.5756 21.1245 5.9601 18.8476 7.4607 11.2938 17.6377 2.1483
temp: 298.150 k
press: 1.00000 atm
elementType: 9 7 6 6 6 6 6 6 6 6 6 1 1 1 1 1 1
symmnumber: 1
zpe: 327697.7 jmol-1
zpe.correction: 0.124813 hartree
zpe.thermalcorrener: 0.132540 hartree
zpe.thermalcorrenthalpy: 0.133484 hartree
zpe.thermalcorrgfe: 0.092233 hartree
zpe.sumelectzpe: -500.402040 hartree
zpe.sumelectthermal: -500.394314 hartree
zpe.sumelectthermalent: -500.393370 hartree
zpe.sumelectthermalfe: -500.434621 hartree
dipole: -0.6467 0.6738 0.0000
dipole: 0.9339
quadrupole: -49.5544 -65.6858 -66.0349
quadrupole: -4.0148 0.0001 0.0001
quadrupole: 10.8706 -5.2608 -5.6098 -4.0148 0.0001 0.0001
hfenergy: -500.5268534 hartree
pointgroup: C01 [X(C9H6F1N1)]
dipole: -0.2646348 -0.2549084 0.0000016 debye
dipolederiv: -0.3241263 0.2047719 -0.0000034 0.3498814 -0.9588028 0.0000122 -0.0000072 0.0000113 -0.1516499 -0.4864601 0.0208956 0.0000022 0.0213904 -0.334447 0.0000025 -0.0000003 0.0000021 -0.2315946 -0.1982328 0.1460298 -0.0000011 0.2016362 -0.254224 0.0000037 0.0000027 0.0000019 0.0470564 0.36514 0.1496961 -0.0000045 -0.0972684 0.0573975 -0.0000007 -0.0000031 -0.0000011 0.0480553 -0.0436019 -0.060396 -0.000001 0.0294345 0.0640528 0.0000027 -0.000003 0.0000071 -0.1414395 0.6113648 -0.1629097 0.000005 -0.3684757 1.1471846 -0.000015 0.0000086 -0.0000136 0.1105191 -0.1363636 -0.0758115 0.0000005 -0.0747255 0.105208 -0.0000038 0.000003 -0.000002 -0.1433075 -0.007168 0.1375123 -0.0000014 0.105993 0.0701584 -0.0000008 -0.0000023 -0.000004 -0.151025 0.1230027 -0.1047804 -0.0000027 -0.100277 -0.0011375 0. -0.0000033 0. -0.1479717 -0.152762 -0.1744224 0.000005 -0.0890972 -0.4495288 0.0000027 0.0000069 0.0000043 -0.1286796 0.2866529 -0.0355254 -0.000002 0.0775844 0.456114 -0.0000076 -0.0000064 -0.0000109 -0.0816878 0.081034 0.0425842 0.0000002 -0.0072854 -0.0401487 -0.0000015 0. -0.0000039 0.1677775 0.0891875 0.0040771 0.0000009 0.0561507 -0.0375978 0.0000015 0.0000014 0.0000026 0.1606288 -0.0300357 -0.1020591 0.0000015 -0.1050678 -0.0011899 0.0000007 0.0000032 0.0000013 0.1607036 -0.1052907 0.0609061 0.0000015 0.0585763 0.0738285 -0.0000005 0.0000009 0.0000001 0.1601974 -0.026132 0.0430124 -0.0000025 0.0453688 0.0982177 0.0000017 -0.0000038 0.0000026 0.1896111 -0.0462088 -0.093581 0.0000017 -0.103819 0.0049149 0.0000021 0.0000028 0.0000023 0.1328064 unknown
polarizability: 151.1793966|8.4292698|109.3923565|-0.0001587|-0.00058|40.1475738 unknown
InChI: InChI=1S/C9H6FN/c10-8-5-6-11-9-4-2-1-3-7(8)9/h1-6H
charge 0 multiplicity 1
17 atoms
F  1.717814 -2.226437 0.000034
N  0.692336 1.884863 -0.000024
C  -0.007124 -0.514295 0.000002
C  -0.299802 0.908387 -0.000017
C  -1.072959 -1.467634 0.000004
C  1.37705 -0.86241 0.000014
C  -1.669032 1.323288 -0.000005
C  -2.398201 -1.024504 0.000005
C  -2.696753 0.375984 0.000007
C  2.380814 0.095513 0.000004
C  1.973757 1.470077 -0.000018
H  -0.835033 -2.535822 -0.000006
H  -1.869349 2.398923 -0.000012
H  -3.217269 -1.751621 0.000012
H  -3.741705 0.704561 0.000014
H  3.436838 -0.184878 0.000019
H  2.738822 2.254707 -0.000034
