program: Gaussian 09
title: 000196976
version: EM64L-G09RevD.01
frameworkgroup: C1[X(C12H10F2N2)]
method: RPBEPBE
basis: SDD
operation: Freq
keyword: #p
keyword: freq=noraman
keyword: PBEPBE/SDD
title: #p freq=noraman PBEPBE/SDD
converged: YES YES NO NO
title: Mulliken charges:
elementType: F F N N C C C C C C C C C C C C H H H H H H H H H H
charge: -0.227025 -0.227025 -0.680721 -0.680721 0.404093 0.404094 -0.517704 -0.517704 -0.399655 -0.399655 0.292215 0.292216 0.166468 0.166468 -0.382890 -0.382889 0.257304 0.257303 0.230694 0.230694 0.221254 0.221252 0.327849 0.308118 0.308118 0.327849
chargesum: 0.00000
title: Mulliken charges with hydrogens summed into heavy atoms:
elementType: F F N N C C C C C C C C C C C C
charge: -0.227025 -0.227025 -0.044754 -0.044754 0.404093 0.404094 -0.260400 -0.260401 -0.168961 -0.168961 0.292215 0.292216 0.166468 0.166468 -0.161636 -0.161637
polarizability: 2.91087662e+02 2.73395551e-06 1.37573019e+02 -6.09759340e+00 -5.35967890e-06 6.45115192e+01
1716.lowfreq: -6.5341 -1.9342 -0.0008 -0.0003 0.0005 3.8052 44.0400 56.8258 84.5557
frequency: 44.0378 56.8188 84.5557 146.2815 185.6404 234.5857 244.7703 270.8001 276.1312 284.0561 315.5365 343.3697 352.1002 378.6023 428.3803 430.4741 434.4794 445.9602 446.4231 476.4482 537.6107 545.1410 565.7897 584.5817 628.5190 668.6984 710.9420 714.8539 756.0697 781.9444 803.0253 810.4662 845.7837 860.0186 872.4951 911.0152 928.7677 933.5935 1013.6183 1020.2758 1035.2282 1110.2736 1134.0059 1167.4767 1168.7186 1257.9382 1261.8027 1296.0662 1327.9085 1348.8665 1358.6007 1381.7464 1441.6857 1448.2117 1513.0647 1543.7377 1565.4061 1575.9046 1621.9768 1622.8679 1652.0038 1656.4285 3125.2330 3126.9978 3150.4109 3154.2900 3161.1552 3164.6389 3571.1422 3572.0441 3714.9773 3714.9893
redmass: 6.2204 5.1712 6.0178 5.2332 5.8422 5.6565 6.5049 6.5975 3.9754 4.8910 3.6196 1.1777 1.3563 5.0372 2.0361 1.8909 4.4696 1.3286 1.4394 5.6362 4.5293 6.0860 7.3334 4.5170 3.7132 6.8432 3.7969 3.4022 6.2606 4.9112 1.4350 1.5102 6.1261 1.4276 1.5927 3.7660 1.3359 1.4475 1.6851 1.6687 1.8799 2.4142 2.6939 1.4504 1.3157 1.6105 1.4794 1.6977 2.1778 2.8932 7.2509 6.4591 4.4562 6.6584 3.7247 3.8459 6.3078 7.3949 1.3961 1.2868 3.7483 4.7242 1.0873 1.0878 1.0959 1.0945 1.0922 1.0916 1.0445 1.0448 1.1045 1.1045
irintensity: 0.1113 3.7492 0.7862 0.0132 0.1125 0.5567 1.6241 13.7473 2.7580 7.0613 50.8911 23.6303 313.5905 0.1812 95.3097 9.0102 0.5767 163.0036 9.3789 0.8601 2.0631 2.0803 16.2317 14.3376 1.3333 1.1780 0.4458 0.8490 38.9995 8.8616 95.7315 8.2255 1.4870 38.5523 4.7469 20.9108 1.2311 1.6671 0.1128 1.1563 3.3330 96.1190 15.2959 56.1558 2.0549 33.6338 0.9958 3.1968 127.9050 12.3294 29.9520 2.4624 2.8615 0.1447 612.1853 5.2933 31.6086 5.9935 0.1219 132.1879 0.1251 474.1380 39.9099 3.8770 4.4333 26.4885 0.5942 0.2351 296.4681 3.8988 5.7014 62.5467
temp: 298.150 k
press: 1.00000 atm
elementType: 9 9 7 7 6 6 6 6 6 6 6 6 6 6 6 6 1 1 1 1 1 1 1 1 1 1
symmnumber: 1
zpe: 510317.7 jmol-1
zpe.correction: 0.194370 hartree
zpe.thermalcorrener: 0.208485 hartree
zpe.thermalcorrenthalpy: 0.209429 hartree
zpe.thermalcorrgfe: 0.153753 hartree
zpe.sumelectzpe: -771.358424 hartree
zpe.sumelectthermal: -771.344309 hartree
zpe.sumelectthermalent: -771.343364 hartree
zpe.sumelectthermalfe: -771.399041 hartree
dipole: 0.0000 -3.3336 0.0000
dipole: 3.3336
quadrupole: -54.9404 -87.5237 -98.0087
quadrupole: 0.0000 -5.2938 0.0000
quadrupole: 25.2172 -7.3661 -17.8511 0.0000 -5.2938 0.0000
hfenergy: -771.5527939 hartree
pointgroup: C01 [X(C12H10F2N2)]
dipole: -0.000005 -1.3115377 0.0000606 debye
dipolederiv: -0.519841 0.3385025 -0.0793533 0.5127528 -0.7797937 0.1578046 -0.1181264 0.1647938 -0.1860873 -0.519852 -0.338512 -0.0793308 -0.5127651 -0.7798065 -0.15776 -0.1180901 -0.1647477 -0.1860631 -2.008608 0.0536118 0.0283626 0.0651572 -0.1529546 -0.1461407 0.0340623 -0.1458066 -0.6971036 -2.0086106 -0.0535831 0.0283748 -0.0651293 -0.15293 0.1460997 0.0340907 0.1457653 -0.6971258 0.252675 -0.030125 -0.0005377 0.0373943 -0.1375816 0.0017307 -0.0109151 0.0311263 -0.0358453 0.2526725 0.0301197 -0.0005392 -0.0374016 -0.1375843 -0.0017233 -0.0109129 -0.0311187 -0.035843 0.0034694 -0.051124 0.0035605 0.0095516 -0.0238484 -0.0485631 -0.0530652 -0.0280078 -0.1161429 0.0034722 0.0511239 0.0035566 -0.0095553 -0.0238425 0.0485566 -0.0530647 0.0280023 -0.1161481 0.0656419 0.1403883 -0.03348 -0.0626038 0.0747387 -0.0751244 0.0619217 -0.0680694 -0.1249876 0.06564 -0.1403911 -0.033469 0.062608 0.0747497 0.0751099 0.0619177 0.0680541 -0.1249978 1.9271787 -0.0666797 -0.04097 0.0792855 -0.1649612 0.0777206 -0.0884278 0.0731255 0.0894166 1.9271799 0.0666471 -0.0409809 -0.079326 -0.1649735 -0.0777016 -0.08843 -0.0731055 0.089428 0.0224821 -0.1974974 0.0493442 -0.9684489 0.8475069 -0.1953274 0.2779939 -0.22904 0.0667114 0.022496 0.1975121 0.0493335 0.9684832 0.8475231 0.1952688 0.277925 0.2289773 0.0666792 -0.3737917 -0.1078341 0.0310591 0.4298138 0.0712586 -0.0932036 -0.1407504 -0.0821979 -0.1838616 -0.3737942 0.1078422 0.0310525 -0.4298174 0.0712779 0.0931851 -0.1407171 0.0821811 -0.1838741 0.0953013 -0.077658 0.0256195 -0.0687074 0.0098554 0.0506115 0.0233699 0.043197 0.1459279 0.095303 0.0776588 0.0256131 0.0687082 0.0098458 -0.0506019 0.0233644 -0.0431876 0.1459344 0.0604892 0.098569 -0.0285502 0.0934676 -0.0248144 0.0536173 -0.0303335 0.0468725 0.129627 0.0604867 -0.0985724 -0.0285437 -0.0934709 -0.0248187 -0.0536054 -0.0303274 -0.0468607 0.1296345 -0.0318202 -0.0942094 0.0340142 -0.1039313 -0.0399705 0.0608594 0.0294794 0.0628853 0.1510635 -0.0318185 0.0942127 0.0340066 0.1039336 -0.0399831 -0.0608455 0.0294712 -0.0628714 0.1510723 0.2591854 -0.0207947 0.0086685 -0.1014626 0.1820287 0.0573783 0.0313256 0.0547948 0.3837161 0.2476388 0.0111957 0.0022624 0.0736058 0.1385342 0.0613688 -0.0165344 0.0621566 0.3775676 0.2476375 -0.0111971 0.0022615 -0.0736069 0.1385252 -0.06135 -0.0165374 -0.0621363 0.377578 0.2591868 0.020794 0.0086652 0.1014651 0.1820188 -0.0573643 0.0313104 -0.0547823 0.3837236 unknown
polarizability: 291.0783829|-0.0013063|137.573019|-6.2676072|-0.0026772|64.520798 unknown
InChI: InChI=1S/C12H10F2N2/c13-9-5-7(1-3-11(9)15)8-2-4-12(16)10(14)6-8/h1-6H,15-16H2
charge 0 multiplicity 1
26 atoms
F  -3.619717 2.026546 -0.498316
F  3.619764 2.026533 0.49836
N  -5.02952 -0.255224 0.15403
N  5.029535 -0.255307 -0.153821
C  -0.742556 -0.301097 0.024463
C  0.742571 -0.301109 -0.024245
C  -1.489929 0.8781 -0.260102
C  1.489961 0.878098 0.260231
C  -1.480171 -1.472385 0.357047
C  1.480169 -1.472432 -0.356742
C  -3.640655 -0.308578 0.122105
C  3.64067 -0.308637 -0.121888
C  -2.88177 0.846456 -0.2026
C  2.881802 0.846431 0.202732
C  -2.88773 -1.482842 0.403645
C  2.887727 -1.482912 -0.40334
H  -0.997112 1.808537 -0.55862
H  0.997157 1.808565 0.558681
H  -0.942081 -2.39007 0.61747
H  0.942066 -2.390128 -0.617097
H  -3.417537 -2.403631 0.67468
H  3.417524 -2.403729 -0.674307
H  -5.507765 0.616768 -0.053424
H  -5.577104 -1.079667 0.377849
H  5.577107 -1.079777 -0.37757
H  5.507795 0.616691 0.053576
