program: Gaussian 09
title: 000197017
version: EM64L-G09RevD.01
frameworkgroup: C1[X(C18H19NO2)]
method: RPBEPBE
basis: SDD
operation: Freq
keyword: #p
keyword: freq=noraman
keyword: PBEPBE/SDD
title: #p freq=noraman PBEPBE/SDD
converged: NO YES NO NO
title: Mulliken charges:
elementType: O O N C C C C C C C C C C C C C C C C C C H H H H H H H H H H H H H H H H H H H
charge: -0.305869 -0.447221 -0.112463 -0.145465 0.052755 -0.676496 0.430152 -0.400855 -0.548152 0.120775 0.373285 0.133313 0.021750 -0.643289 -0.641909 0.210241 -0.461208 -0.359372 -0.243884 -0.264660 -0.519285 0.206259 0.221610 0.244283 0.213019 0.193034 0.235285 0.207280 0.224472 0.228679 0.189356 0.224802 0.234153 0.294285 0.224040 0.224926 0.358082 0.261984 0.226985 0.215321
chargesum: 0.00000
title: Mulliken charges with hydrogens summed into heavy atoms:
elementType: O O N C C C C C C C C C C C C C C C C C C
charge: -0.305869 -0.089139 -0.112463 0.060794 0.052755 -0.210603 0.430152 0.005199 -0.105587 0.120775 0.373285 0.133313 0.021750 -0.418816 0.000928 0.210241 -0.227055 -0.065087 -0.019844 -0.039734 0.185005
polarizability: 2.48735049e+02 -1.19996329e+01 2.71641104e+02 9.50139300e+00 1.70215682e+00 1.15578755e+02
1716.lowfreq: -9.3622 -5.9343 -0.0010 -0.0007 -0.0006 0.9380 43.6244 61.2003 76.2884
frequency: 43.5959 61.1951 76.2847 78.9861 104.1468 152.5734 156.9830 170.9272 197.8875 224.5446 231.9592 241.3553 273.4262 284.7134 311.6298 322.8607 333.9254 342.1247 363.9037 381.7003 397.4813 427.3343 449.2854 453.4447 481.5338 506.6099 533.4849 546.0729 585.3775 604.2714 637.7481 653.2227 670.6917 709.0292 739.2046 751.1406 767.9813 786.7513 798.3976 819.6314 840.1341 866.7221 884.9018 929.0342 952.5071 959.8250 970.1267 986.0191 990.8169 1032.8800 1042.6864 1060.5236 1076.6129 1077.8283 1096.5191 1108.1594 1112.5914 1126.7901 1152.9509 1153.1092 1162.6346 1175.0771 1190.1440 1196.6086 1212.7948 1225.1700 1228.3544 1231.4994 1256.6496 1280.5810 1302.7807 1307.8562 1318.4335 1331.8149 1347.9645 1372.6760 1374.4556 1380.3579 1406.8663 1426.8012 1435.4533 1443.9838 1445.1004 1453.4715 1455.0040 1468.4686 1472.3820 1478.2171 1481.5877 1483.3475 1495.9044 1577.7524 1596.1101 1599.8301 1612.7973 2779.9096 2844.6920 2860.6573 2976.7012 2977.3945 2980.1413 3030.0588 3034.0592 3036.2346 3060.9712 3083.2945 3090.7727 3096.6643 3115.0336 3122.7269 3130.6104 3153.6741 3195.3555 3581.1345
redmass: 3.5573 2.5967 3.5275 3.7212 2.1378 2.1327 2.1813 2.7354 1.5796 2.7645 3.3913 2.8326 3.5033 2.9090 4.5979 2.7499 1.5071 3.2212 3.9589 5.7147 5.0772 3.3597 3.2846 3.0929 3.7163 3.0770 3.8468 4.2991 4.2229 4.6317 5.8308 4.5737 5.5451 3.4062 3.6408 1.7354 4.2262 2.7268 4.5348 1.9914 1.8231 2.6296 1.8039 3.5212 1.6932 2.2070 3.8105 2.1969 1.3242 2.1102 2.4599 3.1504 1.9627 2.4266 2.9503 1.2442 1.4313 1.9150 1.7143 1.4887 1.3002 1.0954 1.4663 1.6235 1.8881 2.3867 2.0090 1.9094 1.4202 1.7593 1.7650 1.6764 1.6264 1.8834 2.1578 4.0991 2.0174 2.8831 3.0151 1.3304 1.1997 1.2997 2.0086 1.1256 1.0823 1.2064 2.0679 1.0940 1.0611 1.0601 2.8905 6.3449 7.3367 7.6771 6.6027 1.0780 1.0680 1.0604 1.0564 1.0354 1.0640 1.0968 1.0790 1.0861 1.0964 1.1008 1.0993 1.0910 1.0866 1.1041 1.0901 1.0984 1.0940 1.0660
irintensity: 0.8699 5.3116 0.6807 0.6418 1.2880 1.6973 1.0226 7.5395 0.6459 1.9164 4.4569 1.3297 3.4622 0.5247 1.9507 33.4772 83.5169 15.0547 1.4210 2.2809 0.3489 3.9151 3.0112 2.6609 2.6805 8.0006 5.0474 6.9300 0.5939 9.8321 25.1599 7.6353 0.9441 0.7438 4.0975 32.6879 12.8932 33.1128 12.1052 17.2998 15.4534 11.2901 2.9894 34.5477 6.2818 10.1033 64.5324 14.6908 0.7123 3.7949 4.2283 21.8007 53.5454 2.8030 19.8435 6.6336 12.6479 57.1773 2.1983 13.3795 0.6868 1.2714 63.5800 21.1483 82.9649 24.1125 29.8925 44.1199 2.4725 35.6937 15.9785 23.6636 4.1860 36.5628 9.4833 19.8045 7.4127 1.2850 23.8991 2.7426 4.2139 26.8449 13.7172 6.8328 10.5994 11.2269 29.8690 13.5898 18.4374 25.8388 34.5758 4.5655 29.1118 4.8527 2.6071 48.2140 49.3840 187.2192 42.8779 67.0459 21.9567 40.6987 5.9691 86.4807 37.5412 33.2300 31.4726 20.5363 6.3134 15.2274 21.0103 43.5906 6.7409 37.8458
temp: 298.150 k
press: 1.00000 atm
elementType: 8 8 7 6 6 6 6 6 6 6 6 6 6 6 6 6 6 6 6 6 6 1 1 1 1 1 1 1 1 1 1 1 1 1 1 1 1 1 1 1
symmnumber: 1
zpe: 858160.1 jmol-1
zpe.correction: 0.326856 hartree
zpe.thermalcorrener: 0.345089 hartree
zpe.thermalcorrenthalpy: 0.346033 hartree
zpe.thermalcorrgfe: 0.281664 hartree
zpe.sumelectzpe: -900.980521 hartree
zpe.sumelectthermal: -900.962287 hartree
zpe.sumelectthermalent: -900.961343 hartree
zpe.sumelectthermalfe: -901.025713 hartree
dipole: 1.8432 -1.8488 0.6735
dipole: 2.6961
quadrupole: -113.7840 -102.6996 -127.4604
quadrupole: -0.0203 -5.2246 -0.6887
quadrupole: 0.8639 11.9484 -12.8124 -0.0203 -5.2246 -0.6887
hfenergy: -901.3073767 hartree
pointgroup: C01 [X(C18H19N1O2)]
dipole: -1.0058216 -0.2149797 -0.2593168 debye
polarizability: 266.3854683|15.1779323|254.4509121|5.6422292|-1.9524378|115.118528 unknown
InChI: InChI=1S/C18H19NO2/c1-19-8-7-12-10-15(20)18(21-2)17-13-6-4-3-5-11(13)9-14(19)16(12)17/h3-6,10,14,20H,7-9H2,1-2H3
charge 0 multiplicity 1
40 atoms
O  1.876385 -2.386716 0.021922
O  -0.265746 -4.153619 -0.057326
N  -2.629282 1.924429 -0.193834
C  -1.230031 1.533202 0.13008
C  -1.01245 0.015183 0.06631
C  -0.206318 2.194455 -0.821092
C  -2.102594 -0.881332 0.001731
C  -3.608451 1.068902 0.520779
C  -3.530707 -0.36281 -0.023653
C  0.339722 -0.471567 0.069492
C  1.195598 1.845343 -0.355483
C  1.455134 0.519669 0.116435
C  0.562387 -1.87964 -0.002036
C  -1.860352 -2.27343 -0.043587
C  -2.88845 3.358631 0.057904
C  -0.546217 -2.770288 -0.040077
C  2.225035 2.811882 -0.351456
C  2.75263 0.22241 0.620239
C  3.516972 2.496665 0.125719
C  3.771186 1.198917 0.623476
C  2.290574 -3.208173 -1.136801
H  -0.977421 1.867688 1.175924
H  -0.325947 3.290984 -0.840282
H  -0.401482 1.819431 -1.846051
H  -4.619108 1.483552 0.352216
H  -3.427423 1.067907 1.627167
H  -3.906966 -0.36108 -1.065457
H  -4.191165 -1.02967 0.564182
H  -2.710385 -2.969758 -0.074064
H  -2.267164 3.991661 -0.596545
H  -2.693754 3.660428 1.118776
H  -3.945147 3.579491 -0.173544
H  2.007636 3.822924 -0.717507
H  2.955713 -0.778922 1.002303
H  4.306918 3.256238 0.124207
H  4.761411 0.945157 1.01854
H  -1.109269 -4.669485 -0.029705
H  1.702299 -4.139465 -1.182771
H  3.354095 -3.431223 -0.960784
H  2.177235 -2.632474 -2.075146
