program: Gaussian 09
title: 000189165
version: EM64L-G09RevD.01
frameworkgroup: C1[X(C11H15N5O2)]
method: RPBEPBE
basis: SDD
operation: Freq
keyword: #p
keyword: freq=noraman
keyword: PBEPBE/SDD
title: #p freq=noraman PBEPBE/SDD
converged: YES YES NO NO
title: Mulliken charges:
elementType: O O N N N N N C C C C C C C C C C C H H H H H H H H H H H H H H H
charge: -0.440318 -0.437181 -0.189328 -0.087376 -0.057651 -0.062308 -0.609829 -0.036392 -0.052907 -0.531286 -0.159160 -0.480900 -0.401581 0.145492 -0.233328 -0.114628 0.169417 -0.375528 0.210725 0.253610 0.230273 0.246779 0.247070 0.252252 0.237162 0.197247 0.211642 0.337268 0.268093 0.341746 0.242321 0.345212 0.333393
chargesum: 0.00000
title: Mulliken charges with hydrogens summed into heavy atoms:
elementType: O O N N N N N C C C C C C C C C C C
charge: -0.103050 -0.095436 -0.189328 -0.087376 -0.057651 -0.062308 0.068776 0.174333 0.200703 -0.054234 0.087911 0.008514 0.007307 0.145492 0.034764 -0.114628 0.169417 -0.133207
polarizability: 2.03838446e+02 5.37655434e+00 1.56607792e+02 7.11489583e+00 -1.36062509e+01 1.07026028e+02
1716.lowfreq: -5.0531 -0.0004 -0.0003 0.0006 4.0395 7.4495 9.9929 39.2986 50.4311
frequency: 8.9674 39.2376 50.4207 78.7184 105.8933 134.6859 160.5619 169.0034 210.5092 223.3229 240.3751 259.1154 277.7757 291.7247 327.4238 338.2123 408.8868 461.0370 482.2483 510.9924 512.4395 518.4709 529.3504 549.5790 568.9733 580.1693 642.0701 646.9165 672.8104 705.8567 722.6561 793.2548 805.8470 824.4729 853.5640 883.3060 916.9583 928.5460 929.2107 953.6898 960.9945 982.2478 1011.2152 1020.1246 1039.2365 1067.9392 1092.1080 1111.6279 1131.5893 1156.3372 1181.0534 1181.5850 1199.6330 1229.4982 1237.2929 1249.5222 1261.3497 1276.9616 1282.3961 1294.9405 1301.8864 1311.6630 1318.3301 1333.9949 1352.8764 1355.3124 1377.2016 1379.4577 1384.5777 1389.8314 1438.2262 1459.0237 1461.1096 1465.7953 1471.6830 1538.4753 1578.7881 1632.1787 2942.8675 2985.3213 3002.4321 3007.1921 3019.2735 3036.5187 3054.8074 3072.7749 3097.6932 3161.4629 3225.5723 3539.4449 3564.6441 3575.4267 3694.6446
redmass: 4.7862 5.8234 4.3980 3.9515 2.6607 4.0601 4.8087 3.6507 5.8472 1.1869 3.6434 4.6529 2.0327 1.9277 4.5302 2.1820 4.7642 2.7342 3.8152 3.8434 4.9787 1.2350 3.8362 1.0483 3.9866 4.6647 3.8472 4.5910 8.1821 6.0403 4.9053 3.9793 2.3325 1.8469 7.7143 1.5809 3.1367 1.5386 1.9114 2.6711 2.4028 2.4867 4.6889 3.1061 2.2348 2.5700 2.2513 2.0042 2.7538 1.4622 1.4266 1.7025 1.9424 2.3696 1.3089 1.3958 2.5364 1.2973 1.4613 1.8661 2.6512 1.3668 4.2951 1.2517 1.9090 1.7578 2.3872 1.2473 1.4273 2.0202 2.7136 1.5128 1.4721 1.3614 1.0909 6.2899 1.9215 2.7096 1.0674 1.0843 1.0665 1.0766 1.0675 1.0840 1.0966 1.1028 1.1018 1.0919 1.0982 1.0443 1.0662 1.0665 1.1056
irintensity: 1.3616 0.3082 1.7183 6.8014 4.1273 4.0096 7.7694 0.8806 8.2461 138.2388 2.1479 9.0688 47.3450 64.1384 6.3936 39.8905 8.1406 3.1842 9.0638 1.4247 4.7601 272.8849 7.3924 0.7789 0.2359 2.4983 9.2638 40.2891 1.2670 0.9648 27.8713 18.8712 4.9530 7.5889 1.0130 18.0130 3.3142 5.5037 47.9039 13.7612 8.7773 53.0019 121.1280 6.4288 68.0245 5.7643 9.4795 7.6955 19.2484 1.4001 23.0834 19.2702 23.0302 53.8560 13.6540 5.2838 12.6817 5.6440 21.4044 27.7924 28.1705 10.0019 31.5800 15.9268 54.0080 65.2353 3.1288 30.9460 1.7813 11.3686 58.8670 19.6909 14.7458 3.2171 5.2770 54.9257 31.8235 628.6010 42.0617 4.3121 21.7175 21.9292 11.4221 18.0057 39.5039 34.8222 25.6817 15.5748 0.1484 130.7577 7.5751 5.7347 49.9174
temp: 298.150 k
press: 1.00000 atm
elementType: 8 8 7 7 7 7 7 6 6 6 6 6 6 6 6 6 6 6 1 1 1 1 1 1 1 1 1 1 1 1 1 1 1
symmnumber: 1
zpe: 692729.9 jmol-1
zpe.correction: 0.263847 hartree
zpe.thermalcorrener: 0.280296 hartree
zpe.thermalcorrenthalpy: 0.281240 hartree
zpe.thermalcorrgfe: 0.217995 hartree
zpe.sumelectzpe: -851.031819 hartree
zpe.sumelectthermal: -851.015370 hartree
zpe.sumelectthermalent: -851.014425 hartree
zpe.sumelectthermalfe: -851.077671 hartree
dipole: -1.7710 1.2412 -0.8268
dipole: 2.3153
quadrupole: -108.2607 -103.6311 -109.8491
quadrupole: 0.5167 4.4982 -5.5298
quadrupole: -1.0137 3.6158 -2.6021 0.5167 4.4982 -5.5298
hfenergy: -851.2956658 hartree
pointgroup: C01 [X(C11H15N5O2)]
dipole: -0.6903577 -0.5362099 0.2562423 debye
polarizability: 204.0202369|-3.7447464|159.1553921|-7.2147026|-6.9053215|104.2966367 unknown
InChI: InChI=1S/C11H15N5O2/c12-10-9-11(14-4-13-10)16(5-15-9)7-1-6(3-17)8(18)2-7/h4-8,17-18H,1-3,12H2
charge 0 multiplicity 1
33 atoms
O  3.568815 0.227597 -2.2002
O  4.212408 0.963143 2.261838
N  -0.407402 -1.268552 0.068407
N  -2.632424 -1.79543 0.34157
N  -0.624254 1.202157 -0.237433
N  -2.971661 1.9370 -0.11877
N  -4.768984 0.445479 0.243433
C  1.055551 -1.46615 -0.057996
C  3.071988 -0.052257 0.268582
C  1.855236 -0.653018 1.019124
C  2.524656 0.195957 -1.165281
C  1.623408 -1.021317 -1.442653
C  3.640387 1.213381 0.928648
C  -1.111057 -0.060513 -0.026386
C  -1.372124 -2.265128 0.286075
C  -2.479766 -0.410707 0.146156
C  -3.425456 0.655572 0.092148
C  -1.625691 2.132595 -0.268181
H  1.212836 -2.549857 0.084604
H  3.880274 -0.806769 0.190395
H  2.143829 -1.29171 1.872002
H  1.213152 0.163009 1.399883
H  1.920389 1.126806 -1.177166
H  2.259723 -1.818934 -1.867596
H  0.824943 -0.800879 -2.16875
H  2.8515 1.997066 0.975518
H  4.493407 1.605922 0.346748
H  4.01391 1.111353 -2.193405
H  -1.094476 -3.31204 0.395196
H  3.485176 0.686826 2.874819
H  -1.314957 3.168825 -0.433327
H  -5.120086 -0.497235 0.398319
H  -5.402049 1.241011 0.194277
