program: Gaussian 09
title: 000189164
version: EM64L-G09RevD.01
frameworkgroup: C1[X(C21H30O2)]
method: RPBEPBE
basis: SDD
operation: Freq
keyword: #pfreq=noraman
keyword: PBEPBE/SDD
title: #p freq=noraman PBEPBE/SDD
converged: YES YES NO NO
title: Mulliken charges:
elementType: O O C C C C C C C C C C C C C C C C C C C C C H H H H H H H H H H H H H H H H H H H H H H H H H H H H H H
charge: -0.287236 -0.442945 0.401715 -0.030562 -0.216864 0.326989 0.356278 -0.528180 -0.501851 -0.534562 -0.461262 -0.443286 -0.858569 -0.661240 -0.795152 -0.783413 -0.776944 0.448511 0.116991 -0.599508 -0.371090 0.284152 -0.351152 0.175825 0.229581 0.219622 0.203841 0.206575 0.210734 0.226357 0.215619 0.196539 0.196736 0.196152 0.202159 0.221840 0.213158 0.225901 0.246861 0.225117 0.224662 0.212717 0.237227 0.215542 0.217557 0.214205 0.223148 0.241116 0.237895 0.223786 0.249429 0.250560 0.348718
chargesum: 0.00000
title: Mulliken charges with hydrogens summed into heavy atoms:
elementType: O O C C C C C C C C C C C C C C C C C C C C C
charge: -0.287236 -0.094227 0.401715 0.145263 0.012717 0.326989 0.356278 -0.104718 -0.084542 -0.092585 -0.067987 -0.044975 -0.197671 -0.189261 -0.120546 -0.136108 -0.074785 0.448511 0.116991 -0.375721 -0.121661 0.284152 -0.100592
polarizability: 2.97948252e+02 -8.80283625e+00 2.14748579e+02 6.35565472e+00 1.08251043e+01 1.67181272e+02
1716.lowfreq: -15.2906 -10.3241 -0.0007 -0.0007 -0.0005 6.6918 38.9507 66.1900 84.9490
frequency: 38.7422 66.0928 84.8624 115.6246 124.5381 136.5743 144.9775 185.7226 203.7535 209.8608 225.3283 228.4219 236.6819 261.9336 271.1279 285.3336 288.5087 295.4458 311.9017 313.3339 315.6481 338.8343 347.7854 362.6395 369.1821 410.9358 418.5976 434.4138 437.5871 446.4132 460.9832 477.7650 479.6083 520.0990 535.0870 548.0958 566.9499 574.1750 589.6362 679.4496 690.7188 706.0474 720.0988 741.0196 757.9570 772.7019 818.3888 821.8569 836.6633 838.6553 846.9001 877.7927 886.0487 910.8381 915.1664 929.2009 932.6482 936.9100 943.9839 954.2472 968.7200 982.0092 984.9032 1002.9835 1015.6151 1023.2293 1041.1784 1066.2159 1073.1121 1088.3057 1096.9616 1101.4025 1121.3033 1129.3983 1134.6724 1155.9877 1163.6443 1167.9595 1173.6837 1189.8694 1196.8171 1205.0580 1211.1952 1216.1406 1234.6539 1247.8192 1252.7706 1264.0824 1283.5267 1288.9459 1303.2122 1311.5667 1326.9562 1329.2731 1332.1824 1340.7180 1343.6637 1351.2765 1359.0482 1368.7624 1377.2548 1384.4493 1390.7115 1395.3118 1397.7087 1432.1958 1452.8329 1458.9701 1464.1699 1465.4008 1466.2296 1470.4706 1471.9458 1479.7537 1480.5347 1486.5210 1489.1422 1490.6710 1494.1776 1497.9716 1498.9583 1607.5790 1622.6301 2923.1444 2950.6385 2964.3723 2967.3410 2968.1759 2974.6206 2977.6456 2981.2633 2982.4049 2988.9141 2993.7059 2999.8024 3017.7838 3025.8616 3027.2201 3031.9682 3041.4030 3051.6138 3058.7690 3059.2923 3064.2552 3075.5481 3087.0472 3090.4047 3092.9347 3094.5403 3104.1124 3154.0682 3177.4322 3585.4716
redmass: 4.8565 3.3028 3.6012 2.7573 3.9160 1.2275 2.1564 3.7014 3.1981 2.3207 1.5398 2.4880 1.3458 1.7350 1.3095 2.5195 2.2561 2.5462 1.8433 1.3132 2.6845 2.6080 3.5633 3.5316 3.0068 2.2936 2.8494 3.2605 2.6812 3.2290 3.0410 2.9322 3.1112 3.0176 3.7156 3.0358 3.1319 2.7898 3.4912 2.9750 3.0611 3.6114 3.6654 4.5360 4.3333 2.6280 1.4123 1.8652 1.7127 1.5191 2.6855 2.3226 2.1692 2.0651 2.0906 1.7506 1.6856 2.9495 1.3426 1.9837 1.8121 1.6073 1.5965 1.7031 2.0087 1.7269 1.8569 1.7057 2.1678 2.0989 2.1778 1.8729 2.0909 1.7319 1.9424 2.0301 1.4875 1.4610 1.8787 1.7777 1.9626 2.0048 2.0151 1.8373 2.0165 1.7660 1.7504 1.7851 1.5875 2.0833 1.4662 1.6399 1.3961 1.3841 1.4985 1.4056 1.4023 1.4428 1.4185 1.2872 1.2025 1.2824 5.8736 1.2516 1.2014 3.7058 1.1007 1.0612 1.0890 1.0667 1.0660 1.0680 1.0696 1.1324 1.1153 1.0744 1.0603 1.3981 1.4162 1.0572 1.0971 7.0197 7.0295 1.0819 1.0798 1.0353 1.0630 1.0614 1.0487 1.0509 1.0640 1.0572 1.0617 1.0377 1.0367 1.0983 1.1007 1.0956 1.0989 1.1027 1.1026 1.0988 1.0991 1.0979 1.0968 1.0979 1.0993 1.0983 1.0910 1.0971 1.0881 1.0971 1.0660
irintensity: 0.0316 0.8984 0.3455 0.1340 0.1328 0.3024 0.4222 0.2970 0.1708 1.7748 0.3199 1.0253 0.1384 0.8429 0.5160 0.0458 0.2670 0.3540 28.0129 108.8507 1.4648 1.5226 0.8712 0.7335 2.5870 0.6261 3.1644 13.4985 9.8483 5.3791 1.6550 1.2605 2.2347 1.2106 1.3096 1.9656 5.0059 3.0373 1.6117 3.3003 9.2532 1.2283 0.3064 10.9136 10.6555 4.1339 21.6938 8.3081 14.9064 39.3154 27.3359 2.4387 25.4196 2.9604 19.2138 8.8782 0.8233 5.2128 0.5714 4.7000 2.4421 11.5522 4.5115 22.5169 2.1006 2.2010 8.0187 19.9821 1.9986 29.3310 33.2784 12.3686 124.4758 164.2352 0.9192 2.0768 41.8170 32.4871 1.0026 31.5541 18.9718 56.3271 1.2265 19.3270 6.0440 14.7129 0.6508 3.4918 1.7008 3.3792 4.7040 23.6365 2.0641 2.0107 4.6150 1.9582 0.8014 1.2769 1.5516 1.2924 14.6424 23.7441 11.6984 39.8406 27.8237 104.9940 2.2739 2.6745 4.8221 10.9700 3.4307 1.8422 7.5806 15.1310 14.1855 15.8430 20.6477 51.5483 92.5254 6.6698 3.8793 4.4469 13.5304 17.3620 9.9756 32.0093 21.4598 35.3100 5.9728 40.7163 43.2622 58.7026 24.7951 17.1166 28.6970 24.2789 42.9956 26.3223 35.6533 77.4791 39.5146 5.9108 37.8205 84.7086 47.8913 25.1784 51.6055 19.0655 22.0233 24.8475 4.6202 8.6452 33.3739
temp: 298.150 k
press: 1.00000 atm
elementType: 8 8 6 6 6 6 6 6 6 6 6 6 6 6 6 6 6 6 6 6 6 6 6 1 1 1 1 1 1 1 1 1 1 1 1 1 1 1 1 1 1 1 1 1 1 1 1 1 1 1 1 1 1
symmnumber: 1
zpe: 1213711.2 jmol-1
zpe.correction: 0.462278 hartree
zpe.thermalcorrener: 0.484054 hartree
zpe.thermalcorrenthalpy: 0.484998 hartree
zpe.thermalcorrgfe: 0.415014 hartree
zpe.sumelectzpe: -966.915261 hartree
zpe.sumelectthermal: -966.893486 hartree
zpe.sumelectthermalent: -966.892542 hartree
zpe.sumelectthermalfe: -966.962525 hartree
dipole: 3.1642 1.9442 1.4322
dipole: 3.9804
quadrupole: -153.5857 -132.8071 -141.8835
quadrupole: -6.2186 -4.6095 2.3483
quadrupole: -10.8269 9.9516 0.8753 -6.2186 -4.6095 2.3483
hfenergy: -967.3775394 hartree
pointgroup: C01 [X(C21H30O2)]
dipole: -1.255551 -0.7454406 0.565923 debye
polarizability: 297.7645284|-9.8063872|214.7885498|-6.0188639|-11.1700866|167.3250248 unknown
InChI: InChI=1S/C21H30O2/c1-19(2)9-5-10-20(3)17(19)8-11-21(4)18(20)13-14-12-15(22)6-7-16(14)23-21/h6-7,12,17-18,22H,5,8-11,13H2,1-4H3
charge 0 multiplicity 1
53 atoms
O  1.505146 1.67796 -0.541249
O  6.027278 -1.640096 0.000806
C  -1.534092 -0.622738 0.373769
C  -2.535454 0.347684 -0.362663
C  -0.068242 -0.147938 0.013912
C  -4.068038 -0.03333 -0.255244
C  0.245074 1.366982 0.236016
C  -2.248797 1.833707 -0.02614
C  -1.715647 -2.07725 -0.215547
C  -0.82166 2.239645 -0.448322
C  -4.230393 -1.588535 -0.16088
C  -3.091965 -2.326531 -0.891674
C  -1.780281 -0.677976 1.90925
C  1.061625 -1.008169 0.629911
C  -4.796324 0.623921 0.94914
C  -4.767833 0.451655 -1.558963
C  0.514289 1.811497 1.688661
C  2.434245 -0.507502 0.197618
C  2.585197 0.790619 -0.358144
C  3.586289 -1.32272 0.322887
C  3.852739 1.246065 -0.794574
C  4.851278 -0.863673 -0.103736
C  4.98717 0.4247 -0.671618
H  -2.283068 0.234434 -1.442393
H  0.004793 -0.266078 -1.090165
H  -2.397529 2.025852 1.054069
H  -2.972211 2.483813 -0.554231
H  -1.572156 -2.812787 0.600388
H  -0.921575 -2.281882 -0.960402
H  -0.70894 2.116436 -1.54293
H  -0.627754 3.304529 -0.219598
H  -5.212398 -1.873182 -0.588285
H  -4.251439 -1.908472 0.899535
H  -3.061344 -1.989405 -1.947077
H  -3.293661 -3.414757 -0.923065
H  -0.962668 -1.217024 2.421296
H  -1.861802 0.320228 2.371386
H  -2.710419 -1.223935 2.138655
H  0.94276 -2.064718 0.325429
H  0.996458 -0.998102 1.73647
H  -4.830642 1.724802 0.858339
H  -5.842308 0.263348 0.989073
H  -4.320874 0.37464 1.913445
H  -4.583479 1.526206 -1.74576
H  -4.404891 -0.109905 -2.440869
H  -5.862578 0.306119 -1.491197
H  -0.39311 1.752521 2.310692
H  1.300161 1.203943 2.168657
H  0.858444 2.860433 1.678189
H  3.479845 -2.330483 0.74987
H  3.92943 2.249455 -1.224396
H  5.973671 0.761827 -1.002083
H  5.827086 -2.520434 0.404443
