program: Gaussian 09
title: 000189155
version: EM64L-G09RevD.01
frameworkgroup: C1[X(C11H16N3O14P3)]
method: RPBEPBE
basis: SDD
operation: Freq
keyword: #p
keyword: freq=noraman
keyword: PBEPBE/SDD
title: #p freq=noraman PBEPBE/SDD
converged: YES YES NO NO
title: Mulliken charges:
elementType: P P P O O O O O O O O O O O O O O N N N C C C C C C C C C C C H H H H H H H H H H H H H H H H
charge: 1.522491 1.475120 1.447255 -0.282134 -0.581371 -0.484089 -0.492841 -0.331028 -0.760694 -0.640382 -0.663146 -0.820948 -0.658563 -0.527404 -0.675365 -0.665951 -0.654999 -0.214524 -0.268106 -0.073851 -0.197342 -0.040510 -0.060798 -0.107925 -0.327605 0.310564 -0.129149 -0.271404 0.208965 -0.150185 -0.308600 0.274344 0.309327 0.288407 0.325477 0.261786 0.248861 0.428674 0.407584 0.295868 0.265395 0.290469 0.265437 0.424873 0.445338 0.435994 0.456684
chargesum: 0.00000
title: Mulliken charges with hydrogens summed into heavy atoms:
elementType: P P P O O O O O O O O O O O O O O N N N C C C C C C C C C C C
charge: 1.522491 1.475120 1.447255 -0.282134 -0.152697 -0.076506 -0.492841 -0.331028 -0.760694 -0.215509 -0.663146 -0.820948 -0.213225 -0.527404 -0.239371 -0.209267 -0.654999 -0.214524 -0.268106 -0.073851 0.077002 0.268816 0.227609 0.217553 0.183042 0.310564 0.166719 -0.006009 0.208965 0.140284 -0.043163
polarizability: 3.43662113e+02 1.59679580e+01 2.38753733e+02 1.66752376e+01 -1.57668638e+01 1.94895319e+02
1716.lowfreq: -8.3787 -2.6604 0.0010 0.0010 0.0014 3.4578 13.6413 25.4773 27.6170
frequency: 13.4542 25.3538 27.5611 37.5820 56.4247 67.0645 73.8891 85.8413 96.8839 108.5288 119.6491 133.9322 137.3450 152.9499 166.8557 174.8973 191.3035 196.8750 201.3564 211.2529 216.8864 222.9070 231.4007 248.4613 250.4887 257.7255 271.9430 280.2621 297.5911 305.5207 315.1235 331.7628 344.1406 350.3185 361.4248 375.7936 382.3751 388.4020 422.8534 433.8873 437.4896 458.9266 474.6398 509.5221 517.6153 525.2614 535.8840 554.7148 559.4390 607.5213 647.5751 652.7808 674.1948 676.7015 680.9027 686.2175 712.4334 729.1203 733.6843 741.1658 757.3478 762.2826 767.1647 786.2271 787.4150 802.8795 822.5970 832.8925 835.5854 876.5344 881.6960 884.7768 891.0054 914.5863 928.7325 935.9300 943.8787 952.0581 977.8649 988.2640 1011.4325 1014.3151 1020.8326 1038.5543 1049.6963 1059.8760 1074.3839 1076.5161 1080.3060 1094.2600 1099.2172 1133.6238 1147.3434 1193.4506 1215.3779 1220.9192 1239.8460 1252.9079 1255.1727 1268.9025 1285.7509 1289.5246 1306.5616 1310.5011 1324.6112 1329.9182 1347.1215 1356.7008 1359.9778 1366.8796 1376.1602 1383.2991 1389.7004 1458.0948 1459.6460 1485.7966 1526.1374 1601.4294 1621.5660 2253.1206 2550.1696 2667.4771 3012.5267 3019.4346 3022.7392 3074.5204 3077.5444 3099.3790 3209.1596 3228.2327 3236.7439 3248.5099 3272.8876 3283.7683 3568.3492
redmass: 8.4619 7.9355 10.9422 7.6605 5.7422 7.7412 11.8121 9.4979 11.7292 10.3562 7.1680 7.8836 5.1736 10.8372 7.3306 7.6243 11.2589 4.1917 3.7273 6.2381 4.1778 7.2777 7.1158 4.0540 4.7546 4.3311 5.7284 7.5584 8.9868 6.8670 9.5050 8.2382 7.2347 9.4211 11.0966 8.9778 5.0715 6.8753 14.8960 6.3517 8.2693 5.0339 6.0215 6.1074 10.4240 5.7968 5.9461 10.4572 6.6898 3.6110 5.4991 7.6739 5.7909 3.1957 1.3383 14.0534 6.5535 3.5006 4.3964 10.4783 9.5708 1.2888 1.3583 2.3434 2.1065 13.7291 3.3574 5.2563 1.4412 3.6682 1.3768 5.4312 3.5542 2.7861 1.5616 1.3458 3.2230 4.9560 2.1149 2.3110 2.1057 3.5609 2.4174 3.2658 2.2932 4.9482 2.7287 3.0565 2.2190 10.6048 2.1047 1.8804 2.5447 1.3198 3.2804 1.1578 1.2025 1.4089 2.8641 1.5217 1.1615 1.1531 1.3179 1.2405 1.1917 1.6464 2.5295 1.2499 1.7663 1.5698 1.4731 2.4632 1.8979 1.0818 3.9599 1.0999 5.6546 8.4768 7.8218 1.0796 1.0770 1.0777 1.0858 1.0822 1.0624 1.0893 1.0914 1.1057 1.0890 1.0997 1.0941 1.0646 1.1060 1.0654 1.0662
irintensity: 0.5065 0.9730 0.7746 1.5951 0.4022 0.2956 1.3015 0.7859 0.1620 9.8770 1.5800 1.7440 19.2160 15.3312 5.8153 2.8620 0.7876 1.8173 31.8575 9.2768 51.4834 0.6844 1.0873 7.8154 1.2830 18.8829 33.8242 9.4446 10.1583 14.5747 17.8761 26.6229 30.2420 12.2422 57.0962 26.5619 5.6233 12.5303 74.5605 2.0526 89.4386 53.0264 4.4257 3.8924 81.1394 11.1662 18.9924 43.2077 1.5078 3.5524 2.1944 74.5184 22.3767 13.2848 89.8634 208.2790 3.6550 20.0672 22.0367 51.2017 171.8830 44.6516 133.9776 210.0389 58.8947 157.9447 0.4462 6.2017 268.3614 148.8384 7.4536 103.9394 132.4332 70.3325 286.3893 29.5000 71.1627 124.3186 59.9446 428.6101 110.5917 331.3196 94.6379 99.2377 28.8944 57.0441 40.4402 22.8808 137.7957 113.8758 35.5896 22.9633 56.4161 20.6799 65.5266 57.6888 108.9947 12.6713 87.0938 11.1808 38.9491 96.3544 8.2440 7.8751 199.6516 44.4576 10.5215 46.9449 9.9897 23.0694 75.1743 22.5493 103.7042 16.6510 13.0524 413.7084 14.2835 250.8764 135.2512 3033.9721 411.7330 1546.0364 1.1505 21.6972 25.6082 3.9821 7.8599 3.8374 13.6419 4.4493 7.1617 611.2942 3.3451 84.8470 143.1989
temp: 298.150 k
press: 1.00000 atm
elementType: 15 15 15 8 8 8 8 8 8 8 8 8 8 8 8 8 8 7 7 7 6 6 6 6 6 6 6 6 6 6 6 1 1 1 1 1 1 1 1 1 1 1 1 1 1 1 1
symmnumber: 1
zpe: 813249.2 jmol-1
zpe.correction: 0.309750 hartree
zpe.thermalcorrener: 0.340244 hartree
zpe.thermalcorrenthalpy: 0.341188 hartree
zpe.thermalcorrgfe: 0.247572 hartree
zpe.sumelectzpe: -2667.488930 hartree
zpe.sumelectthermal: -2667.458436 hartree
zpe.sumelectthermalent: -2667.457492 hartree
zpe.sumelectthermalfe: -2667.551108 hartree
dipole: 7.8593 2.7389 0.2130
dipole: 8.3256
quadrupole: -236.1902 -203.5299 -222.3932
quadrupole: -23.0963 4.7389 1.2626
quadrupole: -15.4858 17.1745 -1.6887 -23.0963 4.7389 1.2626
hfenergy: -2667.7986799 hartree
pointgroup: C01 [X(C11H16N3O14P3)]
dipole: 2.7472245 -0.4593425 -1.7236535 debye
polarizability: 333.0216265|1.0008732|198.8475582|-37.6940568|23.7195762|245.4419804 unknown
InChI: InChI=1S/C11H16N3O14P3/c15-8-6(5-25-30(21,22)28-31(23,24)27-29(18,19)20)26-10(9(8)16)14-3-1-7-12-2-4-13(7)11(14)17/h1-4,6,8-10,15-16,18-19,21,23H,5H2
charge 0 multiplicity 1
47 atoms
P  -3.648791 0.267025 -1.495585
P  -4.466443 2.456617 0.56809
P  -3.741238 0.101367 2.55904
O  0.731039 -1.251372 0.125599
O  -0.29083 0.48214 2.488453
O  1.905609 1.598512 1.993066
O  -2.024294 0.829656 -1.416279
O  4.218864 0.929313 0.863583
O  -4.533247 1.641884 -1.024777
O  -4.084353 0.181628 -3.130582
O  -3.882911 -1.124907 -0.757402
O  -3.36705 1.300158 1.275421
O  -5.953532 2.144243 1.269551
O  -3.971675 3.937696 0.41376
O  -3.413841 -1.327625 1.742193
O  -2.509563 0.294501 3.630648
O  -5.234815 0.402625 3.046008
N  2.94997 -0.520189 -0.492728
N  5.136357 0.069212 -1.120877
N  6.213254 -0.652616 -3.006636
C  1.343527 1.008924 0.794893
C  -0.171015 0.799101 1.04901
C  1.864553 -0.448969 0.549169
C  -0.525489 -0.427293 0.197714
C  -0.888518 -0.118194 -1.276172
C  4.107173 0.204509 -0.18046
C  2.827242 -1.347999 -1.626037
C  3.851322 -1.464295 -2.539046
C  5.061988 -0.737882 -2.311405
C  6.40467 0.668718 -1.107583
C  7.037206 0.210961 -2.265205
H  1.51398 1.641687 -0.096823
H  -0.792993 1.676547 0.808601
H  2.275331 -0.86127 1.491046
H  -1.288022 -1.055126 0.685197
H  -1.101601 -1.069551 -1.79611
H  -0.061447 0.398419 -1.791627
H  0.510889 0.913717 2.922199
H  2.907154 1.543429 1.883577
H  1.882538 -1.88572 -1.696002
H  3.760408 -2.104389 -3.416089
H  6.712828 1.331588 -0.305598
H  8.039828 0.452518 -2.610577
H  -4.532561 0.997109 -3.478359
H  -5.913361 1.452417 2.062232
H  -3.714693 -1.373176 0.742843
H  -1.53125 0.355651 3.18767
