program: Gaussian 09
title: 000189152
version: EM64L-G09RevD.01
frameworkgroup: C1[X(C17H14O5)]
method: RPBEPBE
basis: SDD
operation: Freq
keyword: #pfreq=noraman
keyword: PBEPBE/SDD
title: #p freq=noraman PBEPBE/SDD
converged: YES YES NO NO
title: Mulliken charges:
elementType: O O O O O C C C C C C C C C C C C C C C C C H H H H H H H H H H H H H H
charge: -0.282420 -0.181102 -0.348552 -0.335502 -0.191853 -0.194417 -0.547218 0.095043 0.161236 0.094385 0.483747 0.023178 0.128617 0.086166 -0.020524 -0.444229 -0.374252 -0.838844 -0.227393 -0.222552 -0.228080 -0.235845 0.241120 0.263221 0.257145 0.234269 0.252354 0.257883 0.213922 0.257321 0.214410 0.229937 0.229662 0.374395 0.232184 0.342586
chargesum: 0.00000
title: Mulliken charges with hydrogens summed into heavy atoms:
elementType: O O O O O C C C C C C C C C C C C C C C C C
charge: -0.282420 -0.181102 0.025843 0.007085 -0.191853 0.046702 -0.026852 0.095043 0.161236 0.094385 0.483747 0.023178 0.128617 0.086166 -0.020524 -0.209961 -0.121898 -0.109718 -0.012982 0.007385 0.001582 -0.003660
polarizability: 2.92266677e+02 4.15580463e+00 2.21424093e+02 2.45558204e+00 -1.14395444e+01 1.20010971e+02
1716.lowfreq: -7.3611 -3.2310 -0.0010 -0.0009 -0.0008 4.9668 24.9145 28.1579 47.7873
frequency: 24.8923 28.0735 47.6938 56.7237 60.9663 68.4253 92.1752 125.8166 143.7328 172.0059 191.8874 214.2359 232.6093 264.0642 278.9802 304.6523 319.5568 340.2888 357.0452 368.7086 381.5544 388.4903 400.9664 427.2590 433.3323 469.0181 487.9268 512.1951 537.0705 564.0515 601.4490 615.4972 628.2116 633.5058 655.2391 693.9982 704.8527 740.7605 770.3778 787.9079 809.3200 850.3326 855.2342 879.0285 907.2058 925.6423 966.7867 979.4013 986.1525 989.5718 990.6665 999.2259 1026.1993 1033.1081 1048.6511 1071.4503 1084.3638 1097.0825 1130.3631 1165.6681 1174.5914 1183.0210 1188.2908 1219.0598 1222.4418 1250.7065 1280.3754 1304.8530 1318.7611 1342.3193 1351.2170 1375.6278 1388.1402 1400.0324 1416.5121 1418.4785 1427.8411 1444.0481 1449.7027 1473.8477 1485.4866 1486.5530 1567.8332 1580.1515 1594.0004 1596.4042 1616.7476 1623.3139 2951.6091 2956.7289 2979.5817 2997.8809 3029.5932 3052.4469 3086.7791 3118.5209 3130.3517 3142.1826 3153.6518 3167.5796 3538.8914 3542.2148
redmass: 4.4285 4.6915 1.4276 5.3566 7.8507 7.7399 3.5258 2.2546 2.4381 5.5464 5.4388 6.2536 6.2708 4.9263 5.3269 2.4857 2.5207 4.7785 5.1304 5.3726 5.3746 1.5752 2.8197 5.0822 1.5519 5.5819 5.2817 3.8908 2.9999 6.6628 4.4972 6.0908 6.2665 6.5676 7.8648 5.9647 1.7497 4.0725 1.9268 4.1904 6.3167 4.3116 1.2576 4.6212 3.5756 1.4592 2.9444 1.3994 1.8493 2.3895 4.5166 1.3263 2.2308 1.4601 3.1698 3.7726 1.6364 4.4816 2.8648 1.4199 1.0546 1.5595 1.1134 1.9932 2.2773 1.4797 2.4049 2.0005 1.4839 2.6811 2.0820 3.9738 5.4805 2.8520 1.3368 2.0578 1.0946 2.1662 3.8590 1.0442 1.8646 1.3807 6.6607 7.7688 8.2397 6.1278 6.1214 6.8165 1.0849 1.0393 1.0826 1.0669 1.0998 1.0931 1.0967 1.0878 1.0864 1.0914 1.0960 1.1015 1.0649 1.0648
irintensity: 2.0037 3.0329 2.5400 1.4293 0.2554 4.0945 3.3243 1.8162 13.2406 2.6991 1.8462 1.6906 6.0301 6.6380 7.5144 37.1513 33.8452 4.0812 2.9405 10.3133 13.6741 27.0050 0.8516 4.2461 127.0366 17.9275 1.0609 9.4207 6.9398 8.9360 6.0916 0.4669 1.0370 7.3987 2.9544 2.3701 48.8447 63.9310 54.5206 12.0834 5.4451 15.6245 0.4407 34.2851 66.0436 3.1928 37.0476 0.1465 0.4957 36.6594 7.4098 0.7929 5.5992 2.2282 14.4937 94.2594 18.3138 174.8481 328.4878 26.0174 0.5319 26.3517 4.4050 30.2937 20.9284 5.0759 10.1311 122.2448 4.9760 8.2433 51.2869 3.0724 89.2800 161.6436 9.7764 65.7901 19.8087 7.4514 104.3306 17.3568 45.9770 25.4163 487.0028 84.9005 402.5260 16.0175 4.1177 176.7145 53.6874 34.0890 15.1405 10.8110 13.4814 18.7615 6.4378 7.2178 0.0473 17.2007 32.2218 19.6933 28.0415 45.6001
temp: 298.150 k
press: 1.00000 atm
elementType: 8 8 8 8 8 6 6 6 6 6 6 6 6 6 6 6 6 6 6 6 6 6 1 1 1 1 1 1 1 1 1 1 1 1 1 1
symmnumber: 1
zpe: 705497.8 jmol-1
zpe.correction: 0.268710 hartree
zpe.thermalcorrener: 0.288569 hartree
zpe.thermalcorrenthalpy: 0.289514 hartree
zpe.thermalcorrgfe: 0.218746 hartree
zpe.sumelectzpe: -1030.745839 hartree
zpe.sumelectthermal: -1030.725980 hartree
zpe.sumelectthermalent: -1030.725035 hartree
zpe.sumelectthermalfe: -1030.795803 hartree
dipole: -1.9954 -2.1940 0.2488
dipole: 2.9761
quadrupole: -75.1608 -165.8837 -122.0715
quadrupole: 8.1113 0.9072 -4.9953
quadrupole: 45.8779 -44.8450 -1.0328 8.1113 0.9072 -4.9953
hfenergy: -1031.0145491 hartree
pointgroup: C01 [X(C17H14O5)]
dipole: 0.7771873 0.8727641 0.0723316 debye
polarizability: 292.1483848|4.8104916|222.0101155|-3.5876197|8.8774939|119.5432398 unknown
InChI: InChI=1S/C17H14O5/c1-9-15(20)11(8-18)17-14(16(9)21)12(19)7-13(22-17)10-5-3-2-4-6-10/h2-6,8,13,20-21H,7H2,1H3
charge 0 multiplicity 1
36 atoms
O  -0.593012 -0.515958 0.06374
O  0.633959 3.458663 -0.336112
O  3.170959 2.572034 -0.099053
O  3.852257 -2.25991 0.079384
O  1.622157 -3.830339 0.194687
C  -1.512662 0.615414 0.412197
C  -1.150541 1.818522 -0.469679
C  1.26036 1.110133 -0.059898
C  0.771267 -0.232368 0.032956
C  0.313453 2.238043 -0.271297
C  -2.93053 0.117454 0.225514
C  2.682645 1.272725 -0.045713
C  1.628005 -1.374999 0.080464
C  3.583944 0.17685 0.001801
C  3.038889 -1.136184 0.045538
C  -3.930578 0.47322 1.162301
C  -3.283011 -0.657284 -0.907901
C  5.079048 0.455361 -0.001526
C  1.015388 -2.723461 0.192371
C  -5.271427 0.073793 0.963516
C  -4.620039 -1.066753 -1.100004
C  -5.619379 -0.697715 -0.168721
H  -1.326171 0.863298 1.477746
H  -1.797251 2.682012 -0.240435
H  -1.31274 1.553019 -1.533514
H  -3.663093 1.061422 2.049186
H  -2.506072 -0.957563 -1.619123
H  5.385181 1.076145 0.864218
H  5.69944 -0.456348 0.066354
H  5.407231 0.961222 -0.931867
H  -0.092621 -2.689986 0.283398
H  -6.038425 0.355253 1.693323
H  -4.88342 -1.674839 -1.972506
H  4.162105 2.581995 -0.129886
H  -6.657038 -1.014895 -0.320365
H  4.811323 -2.009974 0.071803
