program: Gaussian 09
title: 000197018
version: EM64L-G09RevD.01
frameworkgroup: C1[X(C18H17NO3)]
method: RPBEPBE
basis: SDD
operation: Freq
keyword: #p
keyword: freq=noraman
keyword: PBEPBE/SDD
title: #p freq=noraman PBEPBE/SDD
converged: YES YES NO NO
title: Mulliken charges:
elementType: O O O N C C C C C C C C C C C C C C C C C C H H H H H H H H H H H H H H H H H
charge: -0.426948 -0.285292 -0.261301 -0.132622 -0.288678 0.091341 -0.360790 0.406502 0.174511 -0.398597 -0.543921 0.411272 0.169061 -0.023332 -0.587878 0.174428 -0.641321 -0.433193 -0.378248 -0.199596 -0.251386 -0.257475 0.230076 0.204544 0.217658 0.199791 0.236896 0.214626 0.259980 0.252497 0.198744 0.226826 0.239701 0.280889 0.355850 0.239568 0.231689 0.227351 0.226777
chargesum: 0.00000
title: Mulliken charges with hydrogens summed into heavy atoms:
elementType: O O O N C C C C C C C C C C C C C C C C C C
charge: -0.071098 -0.285292 -0.261301 -0.132622 -0.058602 0.091341 -0.156246 0.406502 0.174511 0.018853 -0.092399 0.411272 0.169061 -0.023332 -0.327898 0.174428 0.036746 -0.193492 -0.097360 0.271661 -0.024035 -0.030697
polarizability: 2.52252987e+02 -2.27357521e+00 2.71804570e+02 1.57463085e+00 -5.56018541e+00 1.13809211e+02
1716.lowfreq: -7.7537 -5.0506 -0.0008 -0.0006 0.0002 8.6228 46.1659 59.2549 82.7174
frequency: 46.1600 59.1854 82.7160 102.4899 120.2146 141.2095 166.9258 182.3708 191.8084 195.7176 227.4908 264.5672 294.7816 308.9040 320.3074 347.2019 355.7411 368.9404 385.7351 409.8004 448.6943 464.8609 494.7303 515.6024 530.3336 556.1854 589.7577 610.7665 630.5198 646.4773 685.0504 688.9671 709.7228 726.4613 757.8420 763.8847 780.7881 810.3163 817.5077 838.0110 849.7150 866.8918 886.1672 902.4690 923.5871 943.5977 957.4725 968.7240 986.2048 992.7367 1020.2432 1035.1495 1043.4636 1063.0430 1076.1859 1080.3667 1097.2513 1112.2523 1124.0401 1133.7906 1161.4637 1177.3214 1180.7206 1194.3808 1200.7060 1217.6153 1223.4053 1238.4867 1257.5180 1272.6338 1292.6887 1299.3300 1304.6767 1331.3900 1346.4520 1365.2205 1372.8568 1373.7481 1398.7139 1408.4615 1426.8002 1435.0874 1442.1792 1453.6745 1462.3073 1469.5966 1478.7575 1480.2565 1484.0255 1500.7680 1584.9642 1612.1996 1616.7566 1632.2471 2822.2923 2871.2433 2890.7645 2956.2826 2976.7146 2991.0460 3033.0859 3038.1053 3045.6835 3097.4257 3115.1254 3121.5297 3134.5388 3156.9988 3164.9801 3181.0491 3381.2554
redmass: 3.8425 4.5239 4.4399 2.8785 5.2007 3.3755 3.9568 2.9464 1.9895 3.3800 3.1273 2.4675 5.0536 5.5159 4.0697 3.6727 5.5372 4.2503 6.2981 3.9158 3.4213 3.5759 3.0613 3.6749 1.6390 2.0444 3.9381 5.9471 6.3704 6.3102 3.3826 8.4071 7.6922 4.6365 2.4714 4.2033 2.0255 3.9629 3.1783 5.0509 5.0120 1.5766 1.4797 4.6936 4.3952 2.5860 1.5346 3.1019 5.8197 1.3301 3.1301 2.4722 2.2384 2.5171 1.5187 1.9735 3.1275 1.4188 2.0093 1.1064 2.2301 1.1657 1.3238 1.9292 1.6305 1.6393 2.2780 1.7953 1.4953 2.0865 1.2901 1.5510 1.3357 1.6078 1.8367 1.4010 3.1642 1.5096 2.0449 4.3376 2.4251 1.4518 2.9103 1.3743 2.4762 1.0811 1.1027 1.1159 1.0709 2.8119 6.6817 8.1531 6.7960 9.8345 1.0786 1.0699 1.0554 1.0840 1.0611 1.0629 1.0963 1.0927 1.0766 1.1003 1.1078 1.0867 1.0903 1.0976 1.0930 1.0953 1.0646
irintensity: 0.9361 1.7668 3.0406 7.3335 2.6833 7.4320 0.3145 1.8619 0.5790 1.4792 1.4069 1.3772 2.9685 0.3565 11.9849 7.3100 1.5201 0.3795 0.7070 0.3900 1.3081 3.2492 4.5376 6.2860 73.5985 30.5334 4.4488 3.6816 7.1352 9.2959 2.0153 0.6761 2.8780 2.1500 20.6132 11.7242 80.0507 9.5684 6.2627 13.4760 35.3850 19.3494 1.2587 30.8882 16.2505 7.0716 8.1817 16.2569 156.3649 0.0933 2.3551 9.7365 0.8779 16.4481 9.9566 15.3162 33.7013 6.7892 4.8875 3.6549 2.1528 8.5813 6.5968 57.2536 16.6499 8.7285 53.1450 10.9275 34.1210 41.0989 25.8713 31.9488 21.5683 23.2805 13.8291 1.8011 18.6325 18.8116 9.7319 58.9537 4.2791 3.0015 67.0393 20.9255 8.4413 6.8945 12.2553 1.8224 32.1765 32.6696 7.2522 6.8227 2.1683 9.6395 39.1055 60.8270 130.8851 80.5338 30.0371 125.6276 39.3573 33.3591 48.0288 23.3901 28.4762 2.9061 17.4452 36.0409 3.1149 8.7063 42.4277
temp: 298.150 k
press: 1.00000 atm
elementType: 8 8 8 7 6 6 6 6 6 6 6 6 6 6 6 6 6 6 6 6 6 6 1 1 1 1 1 1 1 1 1 1 1 1 1 1 1 1 1
symmnumber: 1
zpe: 815719.4 jmol-1
zpe.correction: 0.310691 hartree
zpe.thermalcorrener: 0.328246 hartree
zpe.thermalcorrenthalpy: 0.329190 hartree
zpe.thermalcorrgfe: 0.266153 hartree
zpe.sumelectzpe: -974.942677 hartree
zpe.sumelectthermal: -974.925122 hartree
zpe.sumelectthermalent: -974.924177 hartree
zpe.sumelectthermalfe: -974.987215 hartree
dipole: 1.0250 -1.4379 -1.9617
dipole: 2.6394
quadrupole: -105.6542 -119.6606 -135.5947
quadrupole: -5.5344 -5.8591 -4.1676
quadrupole: 14.6490 0.6426 -15.2915 -5.5344 -5.8591 -4.1676
hfenergy: -975.2533679 hartree
pointgroup: C01 [X(C18H17N1O3)]
dipole: -0.3332625 -0.620776 -0.7628182 debye
polarizability: 266.5910234|8.9509837|257.3321509|-3.087686|-6.553571|113.943593 unknown
InChI: InChI=1S/C18H17NO3/c1-19-7-6-10-8-13-18(22-9-21-13)15-11-4-2-3-5-12(11)17(20)16(19)14(10)15/h2-5,8,16-17,20H,6-7,9H2,1H3
charge 0 multiplicity 1
39 atoms
O  1.646515 -1.325371 1.866546
O  -1.471742 2.886246 -0.146626
O  -3.667825 1.967765 0.036938
N  0.441191 -3.094111 0.027015
C  0.722586 -1.686181 -0.386821
C  -0.497465 -0.773283 -0.200759
C  1.924472 -1.152379 0.430677
C  -1.803336 -1.301826 -0.066285
C  -0.257228 0.64888 -0.204229
C  -0.838099 -3.58454 -0.553221
C  -2.020454 -2.803217 0.027713
C  2.199861 0.302687 0.108651
C  1.126321 1.178576 -0.229454
C  -1.400952 1.460787 -0.120983
C  -2.935916 -0.44125 0.029752
C  -2.700259 0.928147 -0.00594
C  1.555214 -4.018847 -0.30238
C  3.525031 0.785064 0.132002
C  1.423394 2.532941 -0.545205
C  -2.874907 3.206182 0.219451
C  3.81172 2.133836 -0.17389
C  2.752486 3.00432 -0.51828
H  1.019837 -1.64892 -1.469232
H  2.830132 -1.737837 0.165563
H  -0.937347 -4.657811 -0.309282
H  -0.830061 -3.493898 -1.668274
H  -2.145897 -3.08745 1.091376
H  -2.951845 -3.090899 -0.496353
H  -3.94752 -0.843694 0.130789
H  2.462263 -3.75834 0.265954
H  1.808076 -4.017881 -1.390322
H  1.264133 -5.043245 -0.013598
H  4.335403 0.097222 0.401549
H  0.612583 3.216323 -0.807159
H  1.046335 -2.126331 1.91005
H  -3.25362 3.981952 -0.462332
H  -2.90896 3.506995 1.28465
H  4.844161 2.499074 -0.148568
H  2.960521 4.051215 -0.766288
