program: Gaussian 09
title: 000189151
version: EM64L-G09RevD.01
frameworkgroup: C1[X(C19H15NO4)]
method: RPBEPBE
basis: SDD
operation: Freq
keyword: #p
keyword: freq=noraman
keyword: PBEPBE/SDD
title: #p freq=noraman PBEPBE/SDD
converged: YES YES NO NO
title: Mulliken charges:
elementType: O O O O N C C C C C C C C C C C C C C C C C C C H H H H H H H H H H H H H H H
charge: -0.320115 -0.300171 -0.172103 -0.216710 -0.218267 0.177597 0.208525 0.240606 0.127909 0.269058 0.526826 -0.733699 0.023637 -0.595393 -0.052308 0.239686 0.034471 -0.360524 -0.479138 -0.659492 -0.257136 -0.252977 -0.529376 -0.524353 0.265592 0.305726 0.309475 0.250894 0.239431 0.293043 0.238741 0.230810 0.233821 0.234732 0.272714 0.233129 0.248782 0.235999 0.230558
chargesum: 0.00000
title: Mulliken charges with hydrogens summed into heavy atoms:
elementType: O O O O N C C C C C C C C C C C C C C C C C C C
charge: -0.320115 -0.300171 -0.172103 -0.216710 -0.218267 0.177597 0.208525 0.240606 0.127909 0.269058 0.526826 -0.468106 0.023637 -0.289667 -0.052308 0.239686 0.034471 -0.051049 -0.228244 0.111724 -0.026326 -0.019157 0.211198 0.190986
polarizability: 3.43478900e+02 -4.59000378e+01 3.34167154e+02 1.97335019e+00 -1.17154412e+00 1.04917417e+02
1716.lowfreq: -8.7738 -4.1737 -0.0005 0.0003 0.0006 2.1596 34.3099 47.5788 59.1099
frequency: 34.2625 47.5150 59.0971 64.8827 87.4212 98.6539 113.7550 139.7815 149.9976 155.2405 188.0626 209.8762 228.4489 234.1609 255.0573 267.3791 302.7104 312.6035 330.2008 344.9036 348.9299 359.3409 375.8635 398.1614 407.4175 427.2841 468.0219 492.6070 493.5335 525.4713 536.1276 584.1246 603.1226 611.4323 621.7244 656.1357 709.9553 712.5154 721.1800 758.5886 763.3789 772.4833 797.6494 805.9203 827.2086 867.5749 879.6119 906.5387 923.2519 934.0946 947.6261 969.7288 977.2518 1000.0802 1006.3989 1042.5432 1080.1739 1102.0544 1108.9316 1112.6326 1119.0233 1119.8470 1148.7442 1149.6420 1157.6880 1179.1787 1192.4395 1216.9136 1234.0704 1264.4520 1272.0553 1320.8515 1333.8235 1367.5987 1369.9697 1392.2263 1407.7536 1415.1971 1427.6992 1434.7675 1440.1374 1444.4369 1457.6079 1461.1817 1475.9376 1480.5163 1486.5585 1498.4994 1500.8331 1531.6551 1556.1803 1561.7655 1584.7547 1597.1315 1610.4717 1620.9735 2976.8911 2987.9025 2990.5551 3074.8825 3078.0941 3093.5522 3122.4921 3125.2583 3126.9117 3131.4860 3137.5992 3160.2157 3168.4419 3168.9667 3214.6279
redmass: 4.6447 4.1813 4.0988 5.7410 3.8807 2.7950 2.9586 3.0801 1.2855 1.1926 3.8665 5.4737 2.5986 2.4523 1.8748 5.1191 4.8032 5.3256 5.8003 6.6070 5.5221 6.7693 7.2413 6.1674 5.4687 5.5082 4.0591 7.1013 6.6515 6.3834 3.6715 7.3095 5.2597 4.5815 6.2951 6.2854 6.8773 5.7556 7.4944 2.7475 4.6759 1.6827 7.6347 6.3099 3.4439 1.3831 6.6634 5.3160 1.9682 5.7683 1.6829 4.3872 1.3929 6.0215 1.3461 2.3555 3.3156 2.3825 1.2595 1.2639 3.9014 1.3303 1.8285 1.3589 1.5630 1.1012 1.7033 3.1783 1.8923 4.6094 1.8897 5.4974 2.5856 5.7220 4.3302 3.8096 3.9415 1.3112 1.3268 2.4362 1.9507 2.0040 1.0571 1.0621 1.0551 1.1428 1.0545 1.0482 3.1679 5.9412 8.2313 10.1827 9.3478 8.1546 6.5617 7.1196 1.0304 1.0296 1.0347 1.1050 1.1026 1.1049 1.0871 1.0986 1.1027 1.1043 1.0908 1.0989 1.0907 1.0925 1.0927
irintensity: 2.0882 1.4591 0.9597 0.3394 2.6258 8.1015 3.1642 2.3348 0.1759 1.3239 3.1536 0.6941 3.3444 0.2562 4.0447 9.2503 12.4389 3.9154 0.5779 1.8493 1.5742 4.3994 0.7901 4.7457 5.4790 3.4621 0.8660 0.9473 7.7784 3.2356 9.0347 0.5058 3.0162 14.4946 9.1627 9.4764 0.9763 7.2711 5.2800 25.9854 8.7614 33.5037 0.6051 1.9201 6.9139 20.7331 18.7893 25.0516 16.0078 70.8605 21.8504 40.6113 5.2228 44.5348 1.4097 6.2821 30.0877 44.6162 27.9015 2.2482 32.3763 0.6750 4.7951 2.6031 19.1127 1.1380 7.0511 82.6239 7.7147 31.7577 9.8874 201.3619 19.8950 69.7498 181.0966 4.9116 13.6409 24.7052 67.6150 17.7998 10.3862 7.1216 16.0526 3.7191 6.2281 48.4989 24.5245 20.4182 30.2623 27.0240 18.2309 413.4081 367.5088 2.4255 6.4421 1.4328 69.8588 63.2482 26.6960 22.2401 22.2565 17.2309 2.9939 2.1773 23.0760 12.0453 15.1179 39.7378 7.9135 4.8814 12.3332
temp: 298.150 k
press: 1.00000 atm
elementType: 8 8 8 8 7 6 6 6 6 6 6 6 6 6 6 6 6 6 6 6 6 6 6 6 1 1 1 1 1 1 1 1 1 1 1 1 1 1 1
symmnumber: 1
zpe: 775486.0 jmol-1
zpe.correction: 0.295367 hartree
zpe.thermalcorrener: 0.315914 hartree
zpe.thermalcorrenthalpy: 0.316858 hartree
zpe.thermalcorrgfe: 0.246341 hartree
zpe.sumelectzpe: -1086.994827 hartree
zpe.sumelectthermal: -1086.974280 hartree
zpe.sumelectthermalent: -1086.973336 hartree
zpe.sumelectthermalfe: -1087.043853 hartree
dipole: -7.1052 4.2872 -0.1907
dipole: 8.3006
quadrupole: -147.4632 -129.4183 -137.2544
quadrupole: 26.9734 -1.7347 3.9485
quadrupole: -9.4179 8.6270 0.7909 26.9734 -1.7347 3.9485
hfenergy: -1087.290194 hartree
pointgroup: C01[X(C19H15N1O4)]
dipole: -3.2406949 0.3782325 -0.1404882 debye
polarizability: 376.2623467|-26.5663134|301.1059038|7.65584|-4.7090993|105.1952203 unknown
InChI: InChI=1S/C19H15NO4/c1-20-13-8-10-6-4-5-7-11(10)16-15(13)12(17(21)19(20)22)9-14(23-2)18(16)24-3/h4-9H,1-3H3
charge 0 multiplicity 1
39 atoms
O  -2.378728 -2.066787 0.140002
O  -0.302461 -3.978599 0.115338
O  4.027304 -1.336361 0.170614
O  4.67494 1.392096 0.117808
N  2.398784 1.930419 0.031772
C  0.645824 0.162053 0.011712
C  -0.753878 -0.214236 -0.016899
C  1.02653 1.565063 -0.006857
C  -1.785856 0.83047 -0.116593
C  1.669076 -0.838122 0.080951
C  -1.355139 2.208936 -0.115632
C  0.038698 2.54339 -0.051541
C  -1.046139 -1.621716 0.079291
C  1.335829 -2.206575 0.094259
C  3.10283 -0.475253 0.118602
C  -0.008556 -2.598698 0.075589
C  3.472401 1.011269 0.089995
C  -3.189653 0.58024 -0.249765
C  -2.318153 3.263392 -0.199527
C  2.762358 3.365172 0.011583
C  -4.115921 1.630974 -0.339127
C  -3.684409 2.985721 -0.303981
C  -2.752551 -2.814382 1.372499
C  -0.964519 -4.513513 -1.100113
H  0.300688 3.60416 -0.054216
H  2.131331 -2.957196 0.117371
H  -3.536433 -0.450743 -0.291696
H  -1.962958 4.300579 -0.189895
H  2.394231 3.8477 -0.910931
H  3.860022 3.423903 0.040127
H  2.346227 3.885832 0.892129
H  -5.181998 1.400987 -0.442654
H  -4.413473 3.800384 -0.369638
H  -2.672625 -2.144746 2.247671
H  -2.10559 -3.69826 1.499984
H  -3.799841 -3.113853 1.218069
H  -1.925026 -4.000545 -1.28646
H  -1.130513 -5.581139 -0.892843
H  -0.296154 -4.399219 -1.973601
