program: Gaussian 09
title: 000189148
version: EM64L-G09RevD.01
frameworkgroup: C1[X(C10H15N3O5)]
method: RPBEPBE
basis: SDD
operation: Freq
keyword: #p
keyword: freq=noraman
keyword: PBEPBE/SDD
title: #p freq=noraman PBEPBE/SDD
converged: YES YES NO NO
title: Mulliken charges:
elementType: O O O O O N N N C C C C C C C C C C H H H H H H H H H H H H H H H
charge: -0.297266 -0.454306 -0.467404 -0.447326 -0.335826 -0.207889 -0.043640 -0.621260 -0.045669 -0.133378 -0.203293 -0.056651 -0.437897 -0.322472 -0.107639 0.105580 -0.362773 0.191036 0.268768 0.222523 0.232272 0.276306 0.216871 0.215044 0.240796 0.200713 0.375295 0.392983 0.369589 0.236726 0.337751 0.320520 0.341914
chargesum: 0.00000
title: Mulliken charges with hydrogens summed into heavy atoms:
elementType: O O O O O N N N C C C C C C C C C C
charge: -0.297266 -0.079012 -0.074421 -0.109575 -0.335826 -0.207889 -0.043640 0.041174 0.223099 0.089145 0.028979 0.219655 -0.005982 0.119037 0.261950 0.105580 -0.126047 0.191036
polarizability: 1.97775694e+02 1.48613336e+01 1.55883096e+02 5.16497993e+00 8.17524451e-01 8.85149319e+01
1716.lowfreq: -12.8204 -3.9223 -0.0005 -0.0005 -0.0004 4.8566 37.2924 49.7996 73.3809
frequency: 37.1126 49.6803 73.3779 86.9920 97.2333 133.9990 152.5793 173.1046 192.2113 213.6595 249.7814 276.7867 290.0794 304.4990 320.8301 326.0621 361.7483 396.4578 446.4959 447.2708 448.4821 480.4005 529.5350 555.5995 563.5484 569.0905 574.5981 606.9001 650.1037 697.3550 701.3181 742.8418 751.6320 783.5610 791.9976 822.0670 845.6598 861.0782 892.4033 909.1166 941.4813 980.1562 989.3736 998.4510 1016.5648 1031.3069 1042.2418 1048.7050 1054.5775 1071.4155 1074.8070 1096.7537 1158.2959 1173.4062 1190.2825 1224.4025 1234.8385 1248.3773 1260.5987 1265.7612 1274.9629 1311.8529 1324.2836 1329.6497 1331.3299 1341.4188 1357.4247 1369.1020 1375.9375 1387.3485 1407.3598 1440.0928 1467.8054 1472.2200 1507.6268 1573.4908 1625.0167 1635.1189 2965.4559 2974.4570 2980.1406 2991.5474 3006.3217 3022.9674 3051.0678 3089.8058 3091.7443 3131.1489 3182.7571 3392.9272 3541.8048 3560.6926 3699.2813
redmass: 4.0597 5.7711 5.2843 5.0074 5.3185 4.3311 3.3952 4.9765 6.1834 6.7001 4.3009 4.9300 7.3010 3.1185 5.5832 1.3384 3.5362 4.0201 2.5709 3.1522 1.3275 2.4164 5.8285 4.7918 1.1540 1.2277 8.1906 5.9436 5.0631 3.4302 4.0330 7.0318 6.4383 3.7631 1.6393 1.1692 3.8639 3.7841 3.0002 2.0964 3.0227 3.3909 2.4632 3.2478 1.3877 2.6502 3.3331 2.7423 2.9463 2.4503 3.8215 2.2226 1.3547 1.8683 1.4397 4.9828 1.1611 1.2951 1.2569 1.4231 1.2322 1.2353 1.4306 1.2236 1.2048 1.3757 1.4716 1.8813 1.1974 1.6519 1.5762 1.0864 1.0945 4.2680 3.9916 3.0508 1.7065 5.0813 1.0623 1.0830 1.0687 1.0858 1.0854 1.0959 1.0905 1.0969 1.0675 1.0967 1.0959 1.0641 1.0454 1.0662 1.1045
irintensity: 1.9992 3.2241 2.0635 1.6483 7.6158 1.1015 3.8320 17.4323 1.3684 6.4452 15.2261 27.0076 10.8595 61.4900 4.0165 118.9162 7.8667 19.6969 10.3781 43.4472 148.9758 18.9779 5.3162 2.1952 129.5266 141.0872 6.6128 6.9256 22.4564 0.2875 7.1668 4.8077 11.5461 21.4238 66.7864 107.8993 12.3619 17.6006 8.3580 37.0538 3.6490 99.3292 58.3186 34.9799 11.1403 67.3819 34.5636 66.3885 30.4901 81.7651 36.7554 46.9784 16.0555 34.1008 20.6587 56.8636 16.8459 54.4504 1.1961 60.2212 30.0103 7.9022 6.3666 28.8480 2.9013 38.5920 33.1247 20.9935 11.7773 62.3426 528.7744 11.1267 4.8349 81.1069 127.1983 130.8218 88.0348 784.1612 21.0282 7.8167 59.4744 97.4239 29.5563 16.7318 48.3905 24.3336 587.2752 110.1952 5.7513 51.8916 119.3852 4.1251 40.1788
temp: 298.150 k
press: 1.00000 atm
elementType: 8 8 8 8 8 7 7 7 6 6 6 6 6 6 6 6 6 6 1 1 1 1 1 1 1 1 1 1 1 1 1 1 1
symmnumber: 1
zpe: 680215.8 jmol-1
zpe.correction: 0.259081 hartree
zpe.thermalcorrener: 0.275953 hartree
zpe.thermalcorrenthalpy: 0.276897 hartree
zpe.thermalcorrgfe: 0.214675 hartree
zpe.sumelectzpe: -929.048418 hartree
zpe.sumelectthermal: -929.031546 hartree
zpe.sumelectthermalent: -929.030602 hartree
zpe.sumelectthermalfe: -929.092824 hartree
dipole: 1.2819 7.4233 2.4982
dipole: 7.9367
quadrupole: -85.7990 -113.4189 -106.1678
quadrupole: 5.8564 -5.0907 7.7815
quadrupole: 15.9962 -11.6237 -4.3725 5.8564 -5.0907 7.7815
hfenergy: -929.3074989 hartree
pointgroup: C01 [X(C10H15N3O5)]
dipole: -0.040437 -3.0644676 -0.5979493 debye
polarizability: 190.5805264|-21.9494885|161.1555153|-11.0827366|-5.7376738|90.4376803 unknown
InChI: InChI=1S/C10H15N3O5/c11-6-1-3-13(10(17)12-6)9-8(16)7(15)5(18-9)2-4-14/h1,3,5,7-9,14-16H,2,4,11H2
charge 0 multiplicity 1
33 atoms
O  -1.282586 -0.146369 1.087466
O  -2.829583 2.519246 0.459507
O  -0.645154 2.774722 -0.980656
O  -1.616566 -3.115703 0.267996
O  1.844071 2.060005 -0.524184
N  0.926375 0.023472 0.178225
N  3.254402 0.189236 -0.453473
N  4.616815 -1.687015 -0.417194
C  -2.645175 0.078214 0.496108
C  -2.523348 1.354817 -0.359611
C  -1.022816 1.396285 -0.758025
C  -0.329414 0.772689 0.493397
C  -3.124314 -1.161797 -0.282787
C  -2.945316 -2.501334 0.469735
C  1.037967 -1.335532 0.378034
C  2.045359 0.816751 -0.287356
C  2.250541 -1.969853 0.164022
C  3.366078 -1.146375 -0.235362
H  -3.313391 0.27504 1.353106
H  -3.182075 1.322698 -1.250878
H  -0.825956 0.760632 -1.645782
H  -0.062323 1.577092 1.207285
H  -2.622747 -1.227027 -1.269953
H  -4.204186 -1.010229 -0.486609
H  -3.014826 -2.353827 1.559416
H  -3.734626 -3.217263 0.16141
H  -2.200179 3.232452 0.144867
H  0.367705 2.790211 -0.875137
H  0.127395 -1.856445 0.695282
H  2.343754 -3.045948 0.321566
H  -1.541281 -3.400752 -0.677742
H  4.80299 -2.674294 -0.265435
H  5.370616 -1.059203 -0.692833
