program: Gaussian 09
title: 000196964
version: EM64L-G09RevD.01
frameworkgroup: C1[X(C15H14O3)]
method: RPBEPBE
basis: SDD
operation: Freq
keyword: #pfreq=noraman
keyword: PBEPBE/SDD
title: #p freq=noraman PBEPBE/SDD
converged: YES YES NO NO
title: Mulliken charges:
elementType: O O O C C C C C C C C C C C C C C C H H H H H H H H H H H H H H
charge: -0.247118 -0.163044 -0.139296 0.270012 -0.534027 -0.364202 0.206190 -0.733061 -0.706510 0.064121 0.325650 -0.171546 0.299716 -0.221342 -0.387523 -0.378051 -0.223805 -0.233605 0.237586 0.264213 0.225777 0.228664 0.215690 0.213688 0.227650 0.208493 0.220536 0.241271 0.283669 0.291048 0.237904 0.241252
chargesum: 0.00000
title: Mulliken charges with hydrogens summed into heavy atoms:
elementType: O O O C C C C C C C C C C C C C C C
charge: -0.247118 -0.163044 -0.139296 0.270012 -0.032228 0.090239 0.206190 -0.076032 -0.036210 0.064121 0.325650 -0.171546 0.299716 -0.221342 -0.103854 -0.087003 0.014099 0.007646
polarizability: 2.29286003e+02 1.38043408e+01 2.03678557e+02 -7.90033651e+00 1.55117551e+00 9.14745924e+01
1716.lowfreq: -8.2397 -0.0008 -0.0005 0.0004 5.0360 8.7333 47.4372 60.1436 79.1189
frequency: 47.4264 60.1177 79.1155 121.3175 162.7511 174.4770 188.0696 219.0641 226.8117 257.3871 273.0312 291.7966 303.5170 352.1963 373.2581 384.2631 400.0133 409.2600 422.6267 449.1766 449.3957 530.3264 550.6428 564.9050 603.2971 653.5845 662.3555 701.6978 729.7908 761.8578 787.3220 845.4424 859.4218 897.2945 906.8270 925.8486 926.1693 930.8723 945.1676 959.5743 989.0830 1000.8342 1009.2317 1009.9011 1023.2374 1044.4979 1083.5083 1137.8600 1144.6242 1174.4511 1181.6232 1197.0209 1220.8337 1268.8030 1271.1003 1280.7000 1289.2472 1300.1185 1355.5585 1369.4718 1383.2970 1393.5967 1402.7799 1436.4712 1448.8403 1459.2834 1466.3475 1475.2465 1480.3032 1482.7214 1488.2562 1529.4765 1570.9889 1581.2621 1606.8576 1615.0835 2970.4099 2972.8696 2982.3027 2995.8243 3040.7964 3067.2407 3073.7430 3077.2107 3086.2803 3092.0091 3137.7536 3151.5907 3166.1263 3180.6604
redmass: 6.5763 4.1454 3.9727 4.1915 3.5818 3.8336 1.1267 4.3537 1.2124 3.3926 2.4263 4.2154 3.9657 7.1127 3.4221 4.4293 2.7701 3.8572 2.4884 6.7251 4.4220 5.1320 4.8641 6.9107 6.4688 4.9267 5.3758 6.1432 3.7219 4.4839 1.4466 3.4764 3.4169 1.9656 2.0782 2.3996 1.9472 3.0574 1.4298 4.1610 1.3997 3.8172 1.4000 1.7306 1.6883 1.9021 2.6227 1.9588 1.8673 1.0787 1.7111 1.5527 2.9065 2.3557 1.7708 3.9369 1.9803 1.7634 1.5333 3.1980 1.2166 9.6897 1.2088 2.2290 1.1457 1.0789 1.0524 1.0773 2.3657 1.0972 1.0855 12.3298 8.9532 7.2564 7.9837 8.0339 1.0621 1.0390 1.0368 1.0629 1.0943 1.0996 1.0995 1.0990 1.0993 1.1023 1.0863 1.0911 1.0971 1.0968
irintensity: 0.2367 1.5226 0.9613 0.9469 0.8961 0.9694 1.1742 6.9907 0.9453 1.4191 3.2683 0.3649 1.8303 2.4204 1.1598 2.2412 1.3966 0.3452 0.9537 0.8101 4.2287 2.9718 6.5798 6.1208 1.7813 14.1793 10.7822 1.2600 10.3778 2.4420 58.1110 5.8371 6.3323 8.7897 11.5693 2.7516 1.8429 8.7342 1.2580 56.3946 4.2041 26.4890 0.5159 3.2573 3.1174 0.1330 58.6332 22.7625 39.1088 2.2806 5.6817 23.2834 50.8527 4.7303 36.9186 67.1815 47.4740 7.6625 9.3124 63.9450 23.6848 7.0425 16.8899 6.5924 3.8056 0.8867 1.7888 15.5911 19.5568 9.3001 14.7673 316.5892 19.0094 73.8826 35.9095 9.2435 9.1354 39.3342 25.5904 50.0718 5.3768 29.4174 3.9438 37.8497 33.9933 33.9012 3.5955 5.5727 18.3111 8.8980
temp: 298.150 k
press: 1.00000 atm
elementType: 8 8 8 6 6 6 6 6 6 6 6 6 6 6 6 6 6 6 1 1 1 1 1 1 1 1 1 1 1 1 1 1
symmnumber: 1
zpe: 661264.6 jmol-1
zpe.correction: 0.251862 hartree
zpe.thermalcorrener: 0.267258 hartree
zpe.thermalcorrenthalpy: 0.268202 hartree
zpe.thermalcorrgfe: 0.209833 hartree
zpe.sumelectzpe: -804.378002 hartree
zpe.sumelectthermal: -804.362607 hartree
zpe.sumelectthermalent: -804.361663 hartree
zpe.sumelectthermalfe: -804.420031 hartree
dipole: 2.3139 -6.7453 -0.3746
dipole: 7.1410
quadrupole: -85.7044 -121.4133 -104.7405
quadrupole: 7.1258 -1.7865 0.5762
quadrupole: 18.2484 -17.4606 -0.7878 7.1258 -1.7865 0.5762
hfenergy: -804.6298647 hartree
pointgroup: C01 [X(C15H14O3)]
dipole: 0.8757948 -2.6614752 -0.2066079 debye
polarizability: 229.4723793|13.668034|203.2377403|-8.8704035|3.6758344|91.7290326 unknown
InChI: InChI=1S/C15H14O3/c1-15(2)7-11-13(17)12(16)9-5-3-4-6-10(9)14(11)18-8-15/h3-6H,7-8H2,1-2H3
charge 0 multiplicity 1
32 atoms
O  1.06517 -1.703092 -0.346439
O  0.562398 3.08797 -0.006734
O  -2.22561 2.74086 0.140829
C  3.185194 -0.390141 0.08043
C  2.410349 0.911221 -0.267395
C  2.509903 -1.547363 -0.687273
C  0.906801 0.723816 -0.18389
C  4.652316 -0.282997 -0.399567
C  3.143769 -0.661775 1.606182
C  0.326592 -0.535693 -0.208559
C  -1.123709 -0.777032 -0.077004
C  0.067598 1.916831 -0.048479
C  -2.006591 0.337172 0.049683
C  -1.472092 1.732137 0.053846
C  -1.655445 -2.089608 -0.083238
C  -3.400337 0.123133 0.167002
C  -3.048088 -2.291388 0.039884
C  -3.924221 -1.186586 0.164899
H  2.68642 1.256187 -1.285166
H  2.702538 1.734191 0.410266
H  2.568523 -1.382371 -1.781096
H  2.946405 -2.527938 -0.436345
H  5.229825 -1.190224 -0.14062
H  4.713433 -0.134503 -1.494411
H  5.146576 0.579369 0.083634
H  3.664132 -1.605701 1.854515
H  3.644349 0.157588 2.152919
H  2.108262 -0.735658 1.982566
H  -0.974226 -2.938079 -0.184718
H  -4.050071 0.999795 0.258526
H  -3.450263 -3.310149 0.036383
H  -5.0031 -1.347971 0.258272
