program: Gaussian 09
title: 000196956
version: EM64L-G09RevD.01
frameworkgroup: C1[X(C10H12N2O5)]
method: RPBEPBE
basis: SDD
operation: Freq
keyword: #p
keyword: freq=noraman
keyword: PBEPBE/SDD
title: #p freq=noraman PBEPBE/SDD
converged: YES YES NO NO
title: Mulliken charges:
elementType: O O O O O N N C C C C C C C C C C H H H H H H H H H H H H
charge: -0.283765 -0.462472 -0.256295 -0.445421 -0.247035 -0.162966 -0.408028 -0.086417 -0.064712 -0.235633 -0.219004 -0.345254 -0.145824 0.221439 0.137142 0.084668 -0.422414 0.273282 0.249725 0.272230 0.278526 0.222924 0.203278 0.293626 0.363546 0.240705 0.243650 0.360079 0.340420
chargesum: 0.00000
title: Mulliken charges with hydrogens summed into heavy atoms:
elementType: O O O O O N N C C C C C C C C C C
charge: -0.283765 -0.102393 -0.256295 -0.105001 -0.247035 -0.162966 -0.044482 0.186865 0.185013 0.036597 0.059522 0.080947 0.147802 0.221439 0.137142 0.084668 0.061941
polarizability: 1.81096232e+02 2.51224097e-01 1.43637002e+02 -2.20667878e+00 1.73073058e-01 8.82211231e+01
1716.lowfreq: -6.6193 -4.7168 0.0007 0.0008 0.0010 7.9667 27.7369 34.2529 56.6231
frequency: 27.6761 34.1899 56.6182 71.0254 81.7864 109.0172 126.6394 174.3463 196.4512 209.0362 240.3573 242.5936 250.7062 295.9945 323.3922 357.1388 375.7281 407.6900 418.8372 458.5491 504.6654 526.7330 576.7211 625.6684 688.2534 700.6087 716.9798 735.7888 749.2846 773.1580 784.1897 787.2715 839.8722 867.5731 892.5798 912.9870 948.3805 952.8509 974.1308 978.7104 980.6926 1012.4707 1056.6825 1066.7143 1081.6784 1113.4019 1126.7910 1163.5276 1174.1789 1203.2345 1213.7386 1238.1623 1252.1093 1280.6855 1306.7271 1308.7231 1324.2016 1346.8701 1351.2494 1364.1539 1383.9789 1403.8142 1437.1574 1473.0565 1479.4597 1612.2506 1628.0310 1641.0643 1665.8637 2956.8127 2998.3208 3000.6392 3025.1072 3043.9991 3067.4342 3177.4070 3182.7671 3215.0316 3522.4336 3551.6794 3592.2112
redmass: 5.9484 5.8382 4.2416 4.9652 4.7099 4.6979 4.0671 7.4153 5.5578 2.7822 1.5697 2.5256 3.8435 4.4146 6.1181 1.5118 2.9280 4.8120 7.9723 3.5035 5.1251 4.5808 6.4499 5.3849 2.6861 2.5791 4.7056 4.5555 7.2998 3.0207 2.4618 2.5481 2.7872 3.3376 2.2033 1.7716 3.1309 1.3501 3.5918 4.2232 2.1204 3.8641 1.7802 1.8096 1.9452 1.7715 3.0172 1.3056 1.0828 4.0424 1.2376 1.9461 1.3021 1.3252 1.4531 1.6162 2.0557 1.6833 1.3793 1.6799 1.6520 1.4445 2.7468 1.0785 1.0808 6.0544 6.9043 9.8844 6.5063 1.0560 1.0625 1.0861 1.1058 1.0856 1.1010 1.0921 1.0881 1.1080 1.0769 1.0662 1.0669
irintensity: 0.3293 0.9069 4.2310 5.2859 4.8104 3.4986 0.7064 4.5627 11.7959 56.2564 80.7724 19.3467 33.3382 22.4650 0.6112 146.7148 62.6088 6.8455 2.0446 8.2399 9.8611 20.2715 24.0566 4.0959 12.4170 11.2226 10.2578 1.5321 11.6113 17.5539 110.9375 28.9117 25.4161 60.3318 24.7740 19.5237 56.4413 16.5899 60.7536 104.7116 8.6707 176.2478 4.4956 4.0092 39.8127 33.9126 28.6995 21.0623 1.4148 2.6817 12.9685 161.8917 16.5920 0.0932 0.3319 37.0601 137.1248 3.7270 1.8392 37.6091 11.7544 1.4549 108.0072 5.0713 4.3221 141.1355 21.4469 259.2899 679.2270 47.6233 24.2508 16.0870 71.2056 9.3726 11.8857 2.3065 0.4510 1.8739 60.9306 5.3715 9.8524
temp: 298.150 k
press: 1.00000 atm
elementType: 8 8 8 8 8 7 7 6 6 6 6 6 6 6 6 6 6 1 1 1 1 1 1 1 1 1 1 1 1
symmnumber: 1
zpe: 574319.3 jmol-1
zpe.correction: 0.218747 hartree
zpe.thermalcorrener: 0.235018 hartree
zpe.thermalcorrenthalpy: 0.235962 hartree
zpe.thermalcorrgfe: 0.173437 hartree
zpe.sumelectzpe: -872.591608 hartree
zpe.sumelectthermal: -872.575337 hartree
zpe.sumelectthermalent: -872.574393 hartree
zpe.sumelectthermalfe: -872.636918 hartree
dipole: -3.8305 1.9610 0.3650
dipole: 4.3187
quadrupole: -108.0606 -106.1476 -94.5191
quadrupole: -6.7988 2.1670 -9.7819
quadrupole: -5.1515 -3.2385 8.3900 -6.7988 2.1670 -9.7819
hfenergy: -872.8103545 hartree
pointgroup: C01 [X(C10H12N2O5)]
dipole: 1.428949 -0.9102743 0.1285792 debye
polarizability: 180.7464561|-3.6375533|143.6757047|-2.5444502|-3.9353389|88.5321961 unknown
InChI: InChI=1S/C10H12N2O5/c13-4-6-3-12(10(16)11-9(6)15)8-2-1-7(5-14)17-8/h1-3,7-8,11,13-14H,4-5H2
charge 0 multiplicity 1
29 atoms
O  1.779811 0.62995 -1.055458
O  4.330694 -1.960519 -0.285217
O  -1.168863 3.041095 -0.487361
O  -0.946259 -3.268384 0.344172
O  -4.213172 -0.460785 0.0990
N  -0.325807 0.916271 0.114548
N  -2.647077 1.253102 -0.170359
C  1.082886 1.391486 0.006307
C  3.01745 0.019052 -0.48987
C  1.907244 1.150356 1.258665
C  2.985521 0.379391 0.979626
C  3.030265 -1.491577 -0.783434
C  -0.588323 -0.417151 0.412294
C  -1.368275 1.828873 -0.206851
C  -1.851621 -0.956372 0.43352
C  -3.000423 -0.09811 0.123423
C  -2.088142 -2.423708 0.741406
H  1.003738 2.452233 -0.291614
H  3.88767 0.47806 -0.998838
H  1.624535 1.571677 2.225215
H  3.753667 0.03414 1.67357
H  2.925721 -1.645868 -1.876467
H  2.190273 -1.995771 -0.261627
H  0.283581 -1.038945 0.628692
H  -3.420802 1.887839 -0.393796
H  -3.03489 -2.745764 0.265409
H  -2.182803 -2.598566 1.826691
H  4.460578 -2.910664 -0.525487
H  -0.895275 -3.280141 -0.64586
