program: Gaussian 09
title: 000189144
version: EM64L-G09RevD.01
frameworkgroup: C1[X(C19H18N2O2)]
method: RPBEPBE
basis: SDD
operation: Freq
keyword: #p
keyword: freq=noraman
keyword: PBEPBE/SDD
title: #p freq=noraman PBEPBE/SDD
converged: NO YES NO NO
title: Mulliken charges:
elementType: O O N N C C C C C C C C C C C C C C C C C C C H H H H H H H H H H H H H H H H H H
charge: -0.430262 -0.285842 -0.260621 0.018827 0.409231 -0.507782 0.391512 -0.323621 0.475101 -0.500740 0.057600 0.007569 -0.292704 -0.492929 -0.402206 0.437160 -0.041772 -0.851087 -0.683479 -0.404190 -0.328537 -0.247862 -0.226075 0.272963 0.273701 0.268574 0.245938 0.259283 0.233045 0.199424 0.284618 0.229042 0.241812 0.230177 0.210404 0.220427 0.238234 0.267596 0.337762 0.233901 0.235809
chargesum: 0.00000
title: Mulliken charges with hydrogens summed into heavy atoms:
elementType: O O N N C C C C C C C C C C C C C C C C C C C
charge: -0.092500 -0.285842 -0.260621 0.018827 0.409231 0.038881 0.391512 -0.323621 0.475101 -0.232166 0.057600 0.007569 -0.046765 -0.233646 0.030262 0.437160 -0.041772 -0.095614 -0.022470 -0.165955 -0.060941 -0.013961 0.009734
polarizability: 4.12932332e+02 -2.98917351e+01 2.45214130e+02 4.65632114e+00 9.52308893e+00 1.18084297e+02
1716.lowfreq: -2.3177 -0.7030 -0.0010 -0.0004 0.0005 3.9194 18.5963 43.1485 54.0917
frequency: 18.4018 43.1357 54.0909 78.2732 87.7057 107.0672 124.6418 147.8250 149.2605 179.9508 182.7341 212.0111 236.6563 254.4649 263.9909 267.8975 280.7594 301.4657 317.4687 337.6727 359.8138 399.5869 409.5597 443.7060 453.3675 480.4417 496.0031 519.1625 529.6933 559.0163 590.9083 613.5416 628.8284 650.7085 671.7910 708.3432 732.5961 748.0906 755.2866 763.9034 771.1846 793.8990 800.7023 832.5204 864.8542 874.4468 879.1084 895.7086 914.1590 949.3512 955.7683 968.8420 979.1145 995.7241 998.6592 1018.6862 1032.5823 1036.7640 1061.8844 1081.6567 1101.9503 1123.7137 1136.6746 1155.6498 1159.8822 1175.3572 1193.9013 1200.4696 1220.1711 1227.3267 1245.5405 1247.8888 1254.7191 1277.9622 1312.0386 1316.8086 1341.2076 1358.6549 1375.6567 1389.1662 1392.7443 1394.1334 1401.0247 1410.5465 1425.3189 1460.9661 1468.7880 1471.4949 1472.5098 1480.6070 1486.2624 1489.9026 1503.5392 1528.4337 1557.8664 1563.5967 1619.7652 1627.7460 1650.0091 2977.5949 2979.9407 2980.7341 3002.1156 3038.4450 3048.2570 3054.4849 3073.3318 3081.8121 3084.8922 3100.4456 3123.4547 3132.9898 3140.1150 3157.5660 3165.6927 3172.1578 3544.2298
redmass: 3.7048 4.6702 4.1561 4.1231 5.0320 3.9493 2.3886 1.5893 2.0715 2.2058 3.8065 1.6370 1.8550 1.7321 2.9038 5.9720 3.5149 3.3217 4.7091 4.0507 4.3442 3.7103 3.8513 4.9857 4.7106 2.9262 6.5621 4.0608 3.8343 6.4736 6.5810 4.9015 6.6005 3.4397 4.8635 6.1148 4.2852 3.4485 3.9957 5.4543 1.3406 2.3345 3.0464 1.8084 1.4979 3.5446 1.5401 3.0155 1.5489 3.5771 3.2812 1.3978 3.5136 1.7302 1.4025 2.1654 2.0107 1.4764 2.0701 1.9047 2.5170 2.0239 1.8639 1.8609 1.1063 1.4068 1.8831 2.2042 1.5352 3.8104 2.0704 1.7660 1.8966 2.5110 2.1759 1.5016 1.3593 2.7351 1.3208 1.9015 1.5555 1.2115 6.6124 3.2214 2.7039 1.7478 1.5101 1.1142 1.2441 1.0432 1.0666 1.0519 4.1837 7.4861 8.7683 9.5887 6.5541 7.9404 8.8246 1.0382 1.0418 1.0560 1.0597 1.0972 1.1030 1.0973 1.0974 1.0976 1.0920 1.0973 1.0877 1.0931 1.0890 1.0946 1.0916 1.0997 1.0661
irintensity: 0.6456 0.6425 0.2299 0.3961 0.7597 2.4539 1.8874 3.1905 7.5082 11.2636 5.1977 42.2252 63.6280 33.4143 27.2418 0.5676 0.0267 3.7589 11.6510 4.1348 1.8225 7.9087 0.2442 1.1808 9.0421 8.0013 6.5598 1.9707 0.9306 1.0559 11.9074 0.6820 0.9365 5.9164 9.7719 0.7276 14.3852 2.1591 1.5998 2.0911 61.0951 21.3452 6.6041 8.2538 39.6433 21.8623 4.6160 24.5824 11.8915 59.3247 13.9178 3.8166 2.5343 6.9377 0.5798 7.8220 2.8347 5.5739 8.9193 6.2767 2.7831 10.5114 6.8027 2.1662 0.6987 26.0250 4.6677 18.6520 32.7280 40.1331 10.2742 18.9814 37.1289 1.0038 4.0030 10.1413 2.2900 2.3880 39.0425 81.1704 9.3332 21.3335 19.2763 4.4101 9.9166 24.8674 3.8120 1.4440 13.8692 10.4286 10.5577 20.4992 18.7006 26.4507 15.4969 322.9257 28.2422 31.0009 87.2879 24.2084 43.7791 9.7405 6.4542 11.4330 3.5750 15.8537 18.3321 39.2614 72.4765 2.4486 4.4118 8.6736 10.3594 22.7593 0.4665 26.7111 8.9434
temp: 298.150 k
press: 1.00000 atm
elementType: 8 8 7 7 6 6 6 6 6 6 6 6 6 6 6 6 6 6 6 6 6 6 6 1 1 1 1 1 1 1 1 1 1 1 1 1 1 1 1 1 1
symmnumber: 1
zpe: 854993.1 jmol-1
zpe.correction: 0.325650 hartree
zpe.thermalcorrener: 0.345734 hartree
zpe.thermalcorrenthalpy: 0.346678 hartree
zpe.thermalcorrgfe: 0.276609 hartree
zpe.sumelectzpe: -993.180002 hartree
zpe.sumelectthermal: -993.159918 hartree
zpe.sumelectthermalent: -993.158974 hartree
zpe.sumelectthermalfe: -993.229043 hartree
dipole: 4.8675 -1.5488 1.4674
dipole: 5.3146
quadrupole: -117.4220 -136.9079 -140.9771
quadrupole: 10.7585 -6.6459 -1.7825
quadrupole: 14.3470 -5.1389 -9.2081 10.7585 -6.6459 -1.7825
hfenergy: -993.5056517 hartree
pointgroup: C01 [X(C19H18N2O2)]
dipole: 1.9451884 0.5052062 -0.5770075 debye
polarizability: 415.2582697|22.3664224|243.5004997|-2.135379|5.3632336|117.4719892 unknown
InChI: InChI=1S/C19H18N2O2/c1-3-17(22)14-9-16-18-13(10-21(16)19(23)11(14)2)8-12-6-4-5-7-15(12)20-18/h4-9,17,22H,3,10H2,1-2H3
charge 0 multiplicity 1
41 atoms
O  -3.765579 2.240397 1.709886
O  -2.487104 -3.162983 -0.036292
N  -0.893215 -1.467702 0.032528
N  1.749069 0.984425 0.103899
C  -0.496766 -0.131939 0.101097
C  0.251763 -2.412974 -0.053018
C  1.439631 -1.473614 -0.031574
C  0.970982 -0.108677 0.061069
C  -2.840269 0.513238 0.20344
C  -1.445329 0.870803 0.184008
C  -3.237591 -0.832209 0.132459
C  -2.237791 -1.912841 0.036733
C  -3.859101 1.645486 0.350934
C  2.804972 -1.710145 -0.08248
C  -3.743994 2.738297 -0.736385
C  3.693864 -0.579174 -0.041266
C  3.121088 0.756271 0.052473
C  -4.681916 -1.288029 0.160897
C  -4.052113 2.213412 -2.156227
C  5.117272 -0.719745 -0.088803
C  3.994754 1.888812 0.094527
C  5.945948 0.405001 -0.046238
C  5.380472 1.717052 0.045941
H  0.170314 -3.017253 -0.975396
H  0.219242 -3.118064 0.79811
H  -1.103901 1.908546 0.217473
H  -4.881603 1.237428 0.335024
H  3.218736 -2.722868 -0.152333
H  -4.453559 3.542542 -0.464992
H  -2.730053 3.186824 -0.718181
H  -4.711051 -2.389167 0.136266
H  -5.25307 -0.910202 -0.708165
H  -5.199515 -0.943044 1.075057
H  -3.336165 1.428863 -2.461686
H  -5.070199 1.783416 -2.209153
H  -3.994854 3.030819 -2.897091
H  5.549811 -1.725184 -0.159255
H  3.535767 2.879508 0.165336
H  -2.841933 2.576121 1.847291
H  7.03433 0.287618 -0.082956
H  6.043255 2.588539 0.078541
