program: Gaussian 09
title: 000189131
version: EM64L-G09RevD.01
frameworkgroup: C1[X(C14H21N4O2S)]
method: RPBEPBE
basis: SDD
operation: Freq
keyword: #p
keyword: freq=noraman
keyword: PBEPBE/SDD
title: #p freq=noraman PBEPBE/SDD
converged: YES YES NO NO
title: Mulliken charges:
elementType: S O O N N N N C C C C C C C C C C C C C C H H H H H H H H H H H H H H H H H H H H H
charge: 0.435405 -0.431363 -0.475279 -0.190376 -0.058005 -0.011344 -0.638812 0.574651 0.012861 -0.297415 -0.561034 -0.458860 -0.513499 0.292412 -0.794743 -0.330985 -0.282513 0.094845 -0.395095 0.003783 -0.730717 0.245205 0.286469 0.244109 0.282757 0.256986 0.246413 0.250349 0.264894 0.304741 0.244217 0.240144 0.232644 0.209332 0.257913 0.371687 0.359644 0.334123 0.375865 0.251406 0.246356 0.250829
chargesum: 1.00000
title: Mulliken charges with hydrogens summed into heavy atoms:
elementType: S O O N N N N C C C C C C C C C C C C C C
charge: 0.435405 -0.059675 -0.099415 -0.190376 -0.058005 -0.011344 0.054955 0.574651 0.012861 -0.297415 -0.029360 0.068006 -0.010100 0.292412 0.025241 0.153376 0.159463 0.094845 -0.137182 0.003783 0.017874
polarizability: 2.42518599e+02 -9.62443668e+00 1.89816547e+02 -5.60527403e+00 3.52321608e+00 1.82589792e+02
1716.lowfreq: -6.5229 -3.9479 0.0010 0.0011 0.0014 5.2962 12.0153 15.4669 21.0217
frequency: 11.9496 14.7558 20.9457 29.8713 37.0092 48.4237 85.7623 89.5874 100.3390 117.6457 141.3006 173.1431 176.9504 184.4284 207.2981 232.3939 242.0116 261.5951 275.0166 288.1370 301.4619 307.9360 318.3904 354.3381 372.7463 390.6451 415.2849 432.0768 434.8505 462.4356 470.6247 501.8190 525.1644 558.8679 571.0325 594.5423 611.2085 619.9638 644.3552 656.0171 675.2218 734.5730 765.8043 773.1589 799.0976 837.8510 878.6091 905.8351 915.1459 918.7505 929.9949 965.3003 971.1895 974.8584 1011.2259 1027.4082 1037.2349 1048.2783 1050.8095 1056.9949 1069.6462 1080.7162 1138.3929 1145.0949 1159.8963 1186.0188 1200.8160 1221.9516 1234.7366 1259.9216 1260.8966 1268.5000 1271.9740 1300.8804 1310.1101 1326.9024 1329.0099 1338.0868 1351.3479 1379.7538 1389.8707 1401.9910 1409.6445 1414.0182 1428.6371 1434.7210 1448.3696 1453.9040 1454.1235 1459.3401 1464.2188 1470.7659 1478.3906 1484.1398 1506.5729 1538.3542 1559.2876 1613.4017 1629.2158 2963.4726 2985.7372 2988.1553 2990.9016 3001.6145 3013.5096 3017.3721 3029.1886 3046.4604 3059.0531 3070.5745 3076.8909 3085.3361 3099.1424 3109.5622 3128.1760 3139.5185 3531.5268 3583.4318 3589.3162 3686.0080
redmass: 1.1710 3.0435 5.5257 5.1206 4.5942 3.8991 3.8929 5.8417 3.2264 3.3054 4.0557 2.8644 1.6359 1.9531 5.0381 5.4863 3.6025 3.1358 3.4204 2.6078 1.1598 1.5561 1.7603 2.2030 2.2262 1.5125 2.8557 2.7208 3.4383 3.2636 3.0004 5.1971 5.3479 6.9978 3.5169 1.3105 4.6881 4.5003 3.0180 3.5273 5.2400 4.8631 5.4063 5.5270 3.0252 2.3580 2.9480 2.6922 3.3170 1.5594 2.0567 2.0019 1.8689 1.7517 2.0261 3.4779 2.8834 1.5755 1.6480 2.1835 1.9974 2.1384 1.3105 1.9052 3.3058 1.1386 1.1846 1.6978 1.5244 3.5196 3.3112 4.2816 1.2066 1.8810 1.8021 1.2998 1.4752 1.5819 1.5701 1.2404 1.4263 1.3372 2.2472 1.2455 1.1696 2.9021 1.0947 1.1178 1.1234 1.9486 1.2422 1.1222 1.0804 1.2369 1.1648 5.4034 4.4291 7.3705 1.3191 1.0569 1.0650 1.0419 1.0625 1.0396 1.0711 1.0624 1.0968 1.0974 1.0940 1.0989 1.1017 1.0943 1.1057 1.0913 1.0955 1.1007 1.0470 1.0672 1.0667 1.1026
irintensity: 0.9460 0.3342 0.5753 2.6185 0.9948 1.3044 1.4917 3.9993 5.7178 10.4559 3.6390 2.2709 0.3119 1.1141 5.0716 22.5642 6.9069 13.7714 1.1624 1.9965 163.5595 128.7648 58.6322 20.2697 4.2034 71.5772 0.4758 25.3878 6.2205 1.9210 5.2320 1.4903 3.6619 1.6752 0.6602 112.0103 18.5083 14.7323 31.4360 6.1897 3.7876 5.1549 7.6083 8.1793 6.9736 1.6888 31.8770 4.2161 4.6774 9.5608 6.6502 20.2530 24.1232 21.6125 19.6613 48.1010 18.0283 4.0698 11.0129 6.9042 1.6461 6.8151 34.5593 0.6168 7.1446 17.9711 1.2754 21.2373 3.7663 7.6715 57.5130 1.6712 30.7945 11.1865 3.9557 6.4494 8.2540 25.1912 2.6618 12.0392 3.8146 9.1041 78.7117 14.6588 31.9140 155.6214 4.1794 33.9101 36.4122 20.1643 12.4353 15.2692 5.1265 30.6916 16.2136 167.6642 161.2200 45.4507 314.9495 51.7989 2.1311 10.9900 17.3990 1.1188 4.4792 34.5843 49.3293 2.0953 8.0971 4.7542 5.3138 7.2071 11.8481 25.0625 1.0643 7.1247 114.1475 31.4809 17.8595 34.6533
temp: 298.150 k
press: 1.00000 atm
elementType: 16 8 8 7 7 7 7 6 6 6 6 6 6 6 6 6 6 6 6 6 6 1 1 1 1 1 1 1 1 1 1 1 1 1 1 1 1 1 1 1 1 1
symmnumber: 1
zpe: 894975.6 jmol-1
zpe.correction: 0.340878 hartree
zpe.thermalcorrener: 0.363972 hartree
zpe.thermalcorrenthalpy: 0.364916 hartree
zpe.thermalcorrgfe: 0.284454 hartree
zpe.sumelectzpe: -1311.771711 hartree
zpe.sumelectthermal: -1311.748617 hartree
zpe.sumelectthermalent: -1311.747673 hartree
zpe.sumelectthermalfe: -1311.828135 hartree
dipole: 3.4048 1.9196 3.1784
dipole: 5.0378
quadrupole: -95.2531 -98.1539 -105.8970
quadrupole: -16.8982 -13.4506 -0.2519
quadrupole: 4.5149 1.6141 -6.1290 -16.8982 -13.4506 -0.2519
hfenergy: -1312.1125889 hartree
pointgroup: C01 [X(C14H21N4O2S1)]
dipole: 1.3801006 -0.9497641 -1.0591332 debye
polarizability: 241.0144092|13.9937262|192.6686965|1.5823373|1.2486339|181.2418313 unknown
InChI: InChI=1S/C14H21N4O2S/c1-9-12(3-5-19)21-13(4-6-20)18(9)8-11-7-16-10(2)17-14(11)15/h7,19-20H,3-6,8,15H2,1-2H3
charge 1 multiplicity 1
42 atoms
S  2.870059 -0.790456 0.677669
O  2.511176 -3.264336 1.997538
O  2.59286 3.45637 -0.172471
N  0.807881 -0.507705 -0.864039
N  -4.039529 -0.063361 -0.036461
N  -2.440004 1.13865 1.339214
N  -3.423651 -1.27083 -1.927321
C  1.662417 0.572987 -1.2459
C  1.266109 -1.312905 0.133574
C  2.838877 0.574198 -0.521596
C  -0.544739 -0.683076 -1.475422
C  0.519758 -2.456844 0.752566
C  3.992519 1.537715 -0.582049
C  -1.661851 -0.153413 -0.59208
C  1.248602 1.55237 -2.306523
C  1.429461 -3.66701 1.0952
C  3.793711 2.773848 0.322928
C  -3.030389 -0.492041 -0.859952
C  -1.44694 0.686118 0.521691
C  -3.717621 0.725821 1.028397
C  -4.832711 1.199143 1.919308
H  -0.685543 -1.76089 -1.686852
H  -0.517047 -0.171404 -2.453633
H  -0.290384 -2.796177 0.082033
H  0.025056 -2.102754 1.680061
H  4.129205 1.885328 -1.621443
H  4.931404 1.034799 -0.286787
H  1.249682 1.099301 -3.315538
H  0.245307 1.967962 -2.103045
H  1.939786 2.406908 -2.297059
H  1.927731 -4.047996 0.188843
H  0.809059 -4.474074 1.527447
H  4.690484 3.419809 0.240362
H  3.669465 2.464435 1.381388
H  -0.43565 1.02113 0.7864
H  2.233568 -3.34759 2.943772
H  -4.423534 -1.454336 -2.018066
H  -2.805818 -1.539856 -2.687915
H  2.463302 4.315352 0.300677
H  -5.764634 0.66225 1.691279
H  -4.561963 1.062582 2.979767
H  -5.00027 2.282175 1.77134
