program: Gaussian 09
title: 000189108
version: EM64L-G09RevD.01
frameworkgroup: C1[X(C9H13N3O5)]
method: RPBEPBE
basis: SDD
operation: Freq
keyword: #p
keyword: freq=noraman
keyword: PBEPBE/SDD
title: #p freq=noraman PBEPBE/SDD
converged: YES YES NO NO
title: Mulliken charges:
elementType: O O O O O N N N C C C C C C C C C H H H H H H H H H H H H H
charge: -0.272606 -0.487588 -0.468332 -0.432559 -0.246222 -0.452304 -0.678283 -0.009120 -0.169793 -0.155454 -0.210093 -0.172491 0.235048 -0.364405 0.314873 -0.390726 0.001542 0.285238 0.301723 0.243813 0.256560 0.227847 0.238435 0.380360 0.376085 0.257576 0.348406 0.321121 0.313203 0.408147
chargesum: 0.00000
title: Mulliken charges with hydrogens summed into heavy atoms:
elementType: O O O O O N N N C C C C C C C C C
charge: -0.272606 -0.107228 -0.092248 -0.084154 -0.246222 -0.131182 0.043067 -0.009120 0.115444 0.146269 0.033720 0.084068 0.235048 0.101876 0.314873 -0.133150 0.001542
polarizability: 1.78170461e+02 -7.98826215e+00 1.40706968e+02 -1.04578850e+01 -9.04395382e+00 8.82725297e+01
1716.lowfreq: -3.4413 0.0003 0.0005 0.0008 8.0977 13.4027 30.9831 46.9838 76.8509
frequency: 30.8552 46.9114 76.8445 89.1777 110.5422 154.7250 182.8915 196.2441 196.6962 226.7403 259.2686 282.9026 290.5560 317.1482 370.3680 372.8291 377.1024 419.7138 433.5583 442.8588 470.5559 506.4062 540.4413 562.6009 595.6636 628.8913 666.5000 673.1098 699.6478 724.3593 762.4228 764.3898 795.5045 821.4347 837.1181 869.7953 895.0328 904.2524 958.1031 961.7772 968.0850 993.6544 1021.1866 1033.1895 1038.1830 1055.5352 1079.9072 1103.9772 1142.1521 1198.6279 1209.7247 1213.4219 1229.3292 1264.1315 1274.6820 1295.2647 1307.7057 1321.8530 1323.7585 1343.2555 1347.9498 1361.3841 1365.4901 1372.7876 1385.3807 1446.9655 1474.1808 1562.8304 1594.0876 1645.8091 1694.6845 2936.4947 3003.5718 3025.9629 3073.0744 3092.6782 3113.0592 3136.1573 3276.0193 3411.6165 3504.2992 3537.3940 3576.2223 3611.5035
redmass: 7.0828 6.2340 6.9124 4.4905 5.2514 7.1101 6.5046 5.3362 3.2848 3.5079 2.7901 1.7949 6.5391 4.7857 1.7191 1.8480 3.9159 2.8226 3.2020 1.4922 4.2028 5.6255 5.2190 5.9480 5.3155 1.1152 4.3994 2.5261 2.5904 4.8333 6.4351 4.8005 1.5398 2.0998 4.6598 2.8558 3.7040 2.7758 3.0836 1.8266 4.0907 3.4770 3.1035 3.3186 5.4424 2.1458 2.4497 1.5775 1.2256 1.3842 2.3668 1.2667 1.6011 1.4483 1.2808 1.7586 1.6199 1.2547 1.4279 1.3985 1.2099 3.1852 1.2771 1.2833 1.2266 4.4846 1.0829 6.2924 4.3067 5.9947 1.2093 1.0837 1.0641 1.0872 1.0879 1.1014 1.0891 1.0904 1.0689 1.0645 1.0775 1.0660 1.0668 1.0871
irintensity: 1.0648 6.4633 1.4853 6.4292 8.1658 7.1946 3.3608 2.9676 10.1187 0.6539 74.1238 126.0799 4.9555 1.0575 51.2200 39.1337 11.2455 6.8967 4.9958 75.0180 9.5964 6.6061 5.7974 14.0954 7.5534 93.6186 22.0783 50.2506 24.9198 23.2744 28.1260 31.0399 94.4649 126.1559 11.7620 17.3637 6.4529 7.2103 38.7889 7.4508 217.1923 26.3550 39.0397 14.5424 69.6207 16.6726 6.9560 8.6331 45.7143 50.9655 21.9434 34.6289 3.8745 11.5702 5.7497 4.9755 64.0493 9.6679 105.9757 11.8197 16.9827 14.2253 20.2702 6.4855 46.3774 32.4084 8.5838 282.8105 124.2188 765.3767 203.1812 32.2446 30.3752 27.1933 10.7868 29.0763 5.2771 7.4809 509.6769 64.3093 22.5521 16.0486 13.1554 62.2276
temp: 298.150 k
press: 1.00000 atm
elementType: 8 8 8 8 8 7 7 7 6 6 6 6 6 6 6 6 6 1 1 1 1 1 1 1 1 1 1 1 1 1
symmnumber: 1
zpe: 607004.1 jmol-1
zpe.correction: 0.231196 hartree
zpe.thermalcorrener: 0.247224 hartree
zpe.thermalcorrenthalpy: 0.248169 hartree
zpe.thermalcorrgfe: 0.187610 hartree
zpe.sumelectzpe: -889.811039 hartree
zpe.sumelectthermal: -889.795010 hartree
zpe.sumelectthermalent: -889.794066 hartree
zpe.sumelectthermalfe: -889.854625 hartree
dipole: -7.0411 4.9846 0.6328
dipole: 8.6501
quadrupole: -124.6742 -94.1058 -102.4449
quadrupole: 31.4341 -10.7726 -1.6565
quadrupole: -17.5992 12.9692 4.6300 31.4341 -10.7726 -1.6565
hfenergy: -890.0422343 hartree
pointgroup: C01 [X(C9H13N3O5)]
dipole: 2.7908689 1.941588 -0.1520996 debye
polarizability: 179.0208888|7.2421707|140.8708369|-6.4311186|8.6735788|87.258233 unknown
InChI: InChI=1S/C9H13N3O5/c10-8-3(1-11-9(16)12-8)7-6(15)5(14)4(2-13)17-7/h1,4-7,12-15H,2,10H2
charge 0 multiplicity 1
30 atoms
O  1.330679 -0.628616 -1.247686
O  1.309643 2.511233 0.596948
O  3.465533 1.424457 -0.580309
O  3.303422 -2.242919 1.563855
O  -4.855088 -0.917132 0.142516
N  -3.135952 0.648068 0.212705
N  -1.501863 2.363959 0.362318
N  -2.696009 -1.602785 -0.568508
C  1.319079 1.049401 0.533624
C  2.75039 0.489726 0.318662
C  0.529166 0.51319 -0.712834
C  2.48816 -0.871357 -0.334353
C  -0.90382 0.106793 -0.436516
C  2.157507 -1.989042 0.68122
C  -1.829052 1.063828 0.052886
C  -1.422415 -1.185239 -0.732874
C  -3.633734 -0.693681 -0.075072
H  0.879515 0.691381 1.477918
H  3.35292 0.425293 1.235539
H  0.555582 1.306039 -1.4926
H  3.33403 -1.183808 -0.975359
H  1.840233 -2.895574 0.129885
H  1.33531 -1.689014 1.351255
H  2.110773 2.8132 0.080035
H  3.267548 1.181109 -1.522668
H  -0.726446 -1.925714 -1.144133
H  3.975579 -2.7941 1.090525
H  -3.852126 1.28524 0.576024
H  -2.214742 3.011345 0.694896
H  -0.513518 2.670815 0.388902
