program: Gaussian 09
title: 000189073
version: EM64L-G09RevD.01
frameworkgroup: C1[X(C21H18N2O7S2)]
method: RPBEPBE
basis: SDD
operation: Freq
keyword: #p
keyword: freq=noraman
keyword: PBEPBE/SDD
title: #p freq=noraman PBEPBE/SDD
converged: YES YES NO NO
title: Mulliken charges:
elementType: S S O O O O O O O N N C C C C C C C C C C C C C C C C C C C C C H H H H H H H H H H H H H H H H H H
charge: 0.951474 0.949688 -0.559642 -0.560904 -0.510131 -0.508584 -0.504877 -0.508640 -0.258105 -0.477680 -0.687551 0.669458 -0.294200 0.651637 0.535334 -0.278573 -0.543782 -0.310654 -0.394726 -0.286907 -0.379041 -0.380214 -0.494186 0.554260 -0.456518 0.141693 0.250699 -0.336648 -0.348990 -0.222155 -0.237265 -0.223435 0.290950 0.247548 0.250404 0.248915 0.318853 0.250219 0.294843 0.323228 0.231472 0.324949 0.320100 0.379524 0.275613 0.214383 0.380600 0.236473 0.234369 0.236721
chargesum: 0.00000
title: Mulliken charges with hydrogens summed into heavy atoms:
elementType: S S O O O O O O O N N C C C C C C C C C C C C C C C C C C C C C
charge: 0.951474 0.949688 -0.180118 -0.180303 -0.510131 -0.508584 -0.504877 -0.508640 -0.258105 -0.154452 -0.042502 0.669458 -0.294200 0.651637 0.535334 -0.278573 -0.252833 -0.063105 -0.144322 -0.037993 -0.060188 -0.129994 -0.199343 0.554260 -0.225046 0.141693 0.250699 -0.061035 -0.134607 0.014318 -0.002896 0.013286
polarizability: 7.84646728e+02 -1.67655773e+01 3.50808972e+02 -8.11381972e-01 8.82766952e+00 1.59462151e+02
1716.lowfreq: -5.1814 -2.2217 -0.0002 0.0008 0.0016 2.1116 7.8252 14.6613 23.9324
frequency: 7.8140 14.6221 23.9172 25.4066 30.9277 36.2734 40.2091 50.2221 59.6422 75.7898 90.0429 96.7579 107.2610 115.8119 133.5305 150.9222 166.5177 169.2600 170.1761 183.9637 195.3928 208.0246 219.0480 233.6066 241.4400 257.5939 268.3523 283.5072 300.9330 318.4549 323.8043 325.4530 329.9364 337.7099 375.6977 381.2716 396.4079 400.3829 414.4725 421.8993 426.2460 442.6456 448.3974 452.7056 467.9172 472.4026 514.5133 527.2186 536.7143 547.4454 594.8789 599.2002 606.7850 614.0929 646.3849 654.7818 663.8547 684.8538 688.6709 703.5507 718.7696 747.9463 787.4821 797.5383 818.7243 826.5500 833.3421 836.3978 852.0896 859.4524 863.1450 867.1387 878.1544 883.4902 887.7332 900.0662 935.4901 942.1554 952.2155 956.6907 975.1480 984.9971 989.0510 996.9608 1002.1930 1007.8107 1011.2344 1025.4544 1038.6605 1046.1892 1047.6074 1080.5724 1095.8612 1139.7809 1147.2890 1175.5665 1193.5776 1211.9145 1234.7897 1243.7087 1266.8658 1288.7962 1298.0131 1316.3311 1322.0824 1336.0697 1349.0774 1365.1957 1385.8058 1392.9078 1426.0802 1435.3292 1452.4887 1468.8773 1483.6093 1497.3635 1514.6670 1542.2138 1555.1406 1579.1134 1608.8106 1610.9249 1614.0460 1632.3203 1640.3495 1651.2855 3110.8494 3128.2640 3132.8874 3135.2705 3140.9902 3144.6658 3147.9808 3154.3733 3160.6640 3161.6465 3165.1056 3172.2925 3196.1369 3474.2986 3474.4718 3531.3658 3560.8192 3700.2076
redmass: 7.6498 5.9513 6.2392 4.3370 4.1953 6.6399 7.0521 6.7641 6.3688 6.3907 6.2298 5.1959 5.3426 6.1733 4.3685 6.1296 3.2958 3.6089 2.9080 2.6009 5.8594 2.4299 4.9560 4.2938 4.6559 6.1351 3.7723 5.9912 5.2307 7.2318 7.0926 9.2294 7.2764 5.2040 5.0946 3.7320 1.0561 2.8045 7.9366 5.1542 9.9221 1.8925 1.8899 4.2636 4.5112 4.9877 6.7187 4.5680 9.5778 9.6709 4.2773 5.9372 3.3289 6.3223 3.2307 1.8872 7.4021 5.1389 5.2508 1.5257 2.9028 3.2689 3.0002 4.0919 6.8551 10.9292 1.4986 6.7342 1.3406 1.4965 5.6135 5.7192 5.3868 1.9980 1.7435 1.5311 1.4423 1.6013 10.9785 3.2717 1.3865 1.4625 4.9261 2.6250 3.1954 1.3464 1.3894 2.3906 1.5410 1.1724 1.1769 1.9958 2.2167 1.5434 1.5798 1.0591 1.1159 1.5905 1.4261 2.9279 2.1651 2.1343 2.0425 1.6079 1.4771 2.8658 2.5779 1.4566 8.9096 2.0011 4.6280 2.3923 4.8143 2.2704 2.4715 3.0926 3.8415 5.8408 4.7721 4.5966 5.8098 5.2402 5.3638 4.9551 2.3528 1.6976 1.0889 1.0918 1.0890 1.0867 1.0918 1.0946 1.0915 1.0875 1.0956 1.0888 1.0931 1.1009 1.0954 1.0661 1.0661 1.0761 1.0453 1.1042
irintensity: 1.1340 1.7070 0.7711 1.1824 0.5186 0.2778 0.5790 0.6250 2.1853 5.8768 0.2758 0.0655 3.1373 3.2261 0.6085 1.5086 31.7628 27.4909 8.0858 35.4714 5.2979 0.2328 12.4055 38.9233 3.8198 4.3740 48.0798 6.5156 6.9598 41.3982 26.6425 27.3980 9.4237 0.4862 15.4194 15.7705 5.0043 0.8909 87.9668 34.8461 1.6173 123.2672 153.5996 11.1489 26.4099 7.7636 9.9820 12.7480 3.6415 285.0069 9.7937 13.3147 3.6810 1.8432 3.9951 25.1435 5.6065 14.6310 8.9234 125.3032 0.0917 1.9954 7.0720 24.3634 1.0724 103.7404 37.5418 3.3942 0.4014 28.2903 26.8354 14.5391 5.7433 1.6902 36.3237 36.9871 2.6111 99.9538 5.6803 116.5339 4.4909 3.6676 1.1019 20.2961 52.8456 2.2192 2.0859 12.7609 13.2092 67.5432 93.5689 55.8755 7.1072 13.4515 11.5588 4.3616 30.1245 0.6748 20.5568 304.4260 7.1416 35.3294 44.7565 73.2140 19.9401 179.0718 167.7033 2.0275 2.3446 53.3768 155.0868 13.8613 89.1417 77.7909 15.6641 548.6598 541.0329 1.0548 275.5057 37.6248 1.4522 49.6034 47.8604 326.9562 18.7911 433.7657 19.6104 16.3005 20.9714 0.3836 11.7588 0.3701 17.1348 28.8769 14.6920 1.9316 14.3526 30.7276 8.7425 36.7290 40.2075 24.9457 269.4803 27.8530
temp: 298.150 k
press: 1.00000 atm
elementType: 16 16 8 8 8 8 8 8 8 7 7 6 6 6 6 6 6 6 6 6 6 6 6 6 6 6 6 6 6 6 6 6 1 1 1 1 1 1 1 1 1 1 1 1 1 1 1 1 1 1
symmnumber: 1
zpe: 925878.0 jmol-1
zpe.correction: 0.352648 hartree
zpe.thermalcorrener: 0.384830 hartree
zpe.thermalcorrenthalpy: 0.385774 hartree
zpe.thermalcorrgfe: 0.284271 hartree
zpe.sumelectzpe: -2240.611230 hartree
zpe.sumelectthermal: -2240.579048 hartree
zpe.sumelectthermalent: -2240.578104 hartree
zpe.sumelectthermalfe: -2240.679607 hartree
dipole: -0.9095 3.2797 -0.1785
dipole: 3.4082
quadrupole: -99.0328 -213.0235 -214.6401
quadrupole: -24.6593 3.0261 20.4579
quadrupole: 76.5327 -37.4581 -39.0746 -24.6593 3.0261 20.4579
hfenergy: -2240.9638778 hartree
pointgroup: C01 [X(C21H18N2O7S2)]
dipole: 0.4507496 -1.2612762 -0.06306 debye
polarizability: 784.7293293|15.0035586|350.5054955|-5.150531|-10.695348|159.6830269 unknown
InChI: InChI=1S/C21H18N2O7S2/c22-17-10-8-14(19(12-17)31(25,26)27)6-7-15-9-11-18(13-20(15)32(28,29)30)23-21(24)16-4-2-1-3-5-16/h1-13,23,25,28H,22H2
charge 0 multiplicity 1
50 atoms
S  0.063223 -3.496461 -0.106578
S  4.467599 3.011074 0.181266
O  0.601892 -3.567551 1.673422
O  3.87114 3.135511 -1.577107
O  -1.20855 -4.478006 -0.311867
O  1.382363 -3.733869 -1.018811
O  3.176744 3.202622 1.142413
O  5.738311 3.993587 0.381586
O  -4.309296 2.05083 -0.019466
N  -3.951176 -0.268832 0.003298
N  8.453025 -0.290568 -0.089299
C  0.358706 -0.60647 -0.013419
C  -0.541529 -1.707391 -0.054245
C  4.16885 0.130575 -0.020111
C  -2.537517 -0.330994 -0.001796
C  5.076133 1.223269 0.047584
C  -1.937856 -1.613785 -0.047034
C  1.814475 -0.757086 -0.026105
C  -0.298838 0.66538 0.040325
C  2.713613 0.280031 0.002562
C  -1.691363 0.815601 0.046409
C  4.820091 -1.142798 -0.123724
C  6.471722 1.135986 0.02543
C  7.073056 -0.149525 -0.069424
C  6.210171 -1.286294 -0.149153
C  -4.770137 0.869753 0.029812
C  -6.248893 0.593998 0.099358
C  -7.11867 1.634447 -0.318421
C  -6.803967 -0.620652 0.585222
C  -8.51612 1.456621 -0.277501
C  -8.204146 -0.795646 0.629506
C  -9.063323 0.238755 0.191776
H  -2.537716 -2.5313 -0.081037
H  2.185815 -1.784456 -0.078796
H  0.315171 1.56954 0.085815
H  2.340847 1.306854 0.060636
H  -2.147627 1.806105 0.081966
H  4.202487 -2.042665 -0.199057
H  7.075655 2.048152 0.085741
H  -4.430941 -1.169603 -0.056052
H  6.64754 -2.287917 -0.234312
H  9.063603 0.520346 -0.038144
H  8.881315 -1.209413 -0.159903
H  0.972541 -4.484242 1.835037
H  -6.673049 2.572645 -0.664324
H  -6.164485 -1.422064 0.976973
H  3.48094 4.050851 -1.694371
H  -9.17825 2.263861 -0.608215
H  -8.623553 -1.730973 1.015221
H  -10.14942 0.100164 0.226115
