program: Gaussian 09
title: 000189043
version: EM64L-G09RevD.01
frameworkgroup: C1[X(C5H9NO2S)]
method: RPBEPBE
basis: SDD
operation: Freq
keyword: #p
keyword: freq=noraman
keyword: PBEPBE/SDD
title: #p freq=noraman PBEPBE/SDD
converged: NO YES NO NO
title: Mulliken charges:
elementType: S O O N C C C C C H H H H H H H H H
charge: 0.483027 -0.422357 -0.321284 -0.460491 -0.426386 -0.277037 -0.649883 -0.772129 0.175601 0.237486 0.285691 0.274870 0.359607 0.288001 0.306193 0.249113 0.393880 0.276097
chargesum: 0.00000
title: Mulliken charges with hydrogens summed into heavy atoms:
elementType: S O O N C C C C C
charge: 0.483027 -0.422357 -0.321284 -0.154298 0.096791 -0.002167 -0.002274 0.146961 0.175601
polarizability: 1.17816916e+02 -5.23994120e+00 8.27204840e+01 2.95532670e+00 -1.51492809e+00 7.34764428e+01
1716.lowfreq: -21.3874 -10.4862 -0.0022 -0.0021 0.0018 14.1511 41.1652 138.6539 172.3962
frequency: 41.1635 138.6048 172.3859 188.8152 225.1417 250.8181 287.1655 311.6971 361.6710 418.1894 436.9407 542.6808 565.4300 605.4140 680.5054 722.3685 777.6966 834.9497 879.6082 906.0200 921.7995 1002.6435 1013.8742 1033.1471 1049.9281 1101.0655 1154.0288 1206.4425 1225.4328 1244.5057 1280.5283 1314.2474 1332.7512 1350.0284 1380.8400 1402.8273 1446.6074 1481.5449 1570.9535 2825.4455 2993.9491 3032.2252 3044.4303 3076.7694 3084.2353 3148.3795 3157.2149 3300.6269
redmass: 8.8596 3.0768 5.8573 2.7068 1.4481 3.0088 2.3921 3.5790 5.8046 5.9896 5.1619 3.6205 5.0333 7.0169 3.7476 4.4711 3.1229 2.1696 2.6141 2.5977 1.9852 1.3476 1.5266 1.8161 1.4108 1.1227 1.2699 1.7699 3.1423 1.2604 1.2046 1.2426 1.1518 1.3232 1.1217 1.0566 1.0919 1.0550 7.1719 1.0571 1.0635 1.0845 1.0572 1.1002 1.0792 1.1123 1.1054 1.0754
irintensity: 0.0501 9.2667 2.3623 7.8134 4.8158 7.2048 2.5086 18.7497 7.1983 44.2195 20.6847 17.0627 9.0444 2.3338 28.4760 5.8165 24.3739 12.2843 12.1233 20.8511 3.2495 7.1581 0.9094 6.7679 16.3447 1.5060 10.5144 21.2008 100.2986 20.2357 13.0287 5.6526 28.3968 12.9298 54.0384 8.8723 13.0210 25.9262 180.3529 154.3485 22.8230 14.1405 24.6025 4.7948 4.7131 0.7010 2.1247 35.7636
temp: 298.150 k
press: 1.00000 atm
elementType: 16 8 8 7 6 6 6 6 6 1 1 1 1 1 1 1 1 1
symmnumber: 1
zpe: 362012.3 jmol-1
zpe.correction: 0.137883 hartree
zpe.thermalcorrener: 0.147550 hartree
zpe.thermalcorrenthalpy: 0.148494 hartree
zpe.thermalcorrgfe: 0.102965 hartree
zpe.sumelectzpe: -798.387068 hartree
zpe.sumelectthermal: -798.377402 hartree
zpe.sumelectthermalent: -798.376457 hartree
zpe.sumelectthermalfe: -798.421986 hartree
dipole: -9.5183 -5.2768 0.1802
dipole: 10.8846
quadrupole: -75.2328 -58.9478 -57.1880
quadrupole: -9.8272 1.6418 0.8669
quadrupole: -11.4433 4.8417 6.6016 -9.8272 1.6418 0.8669
hfenergy: -798.5249514 hartree
pointgroup: C01 [X(C5H9N1O2S1)]
dipole: 3.5694249 1.8135318 1.5194097 debye
dipolederiv: -0.5373544 -0.0266742 -0.3296414 -0.1048255 0.1238309 -0.0004224 0.1101464 0.0988849 0.2404449 -0.8813099 0.1939976 0.1777448 0.2070274 -0.7264245 -0.2638735 0.1617502 -0.2869484 -0.6831167 -1.0995181 0.054248 0.0600192 -0.07502 -0.4867326 -0.1276893 -0.1726494 -0.1117806 -0.5067515 0.3310547 0.0373076 0.1719231 0.1282131 -0.2841886 0.3203743 -0.0883555 0.0580022 -0.2549746 -0.0085643 0.0184288 0.0465544 0.0410421 0.038307 0.1215221 0.0189735 0.2181014 -0.0052437 0.2282133 -0.0096907 0.0507861 0.0218455 0.0697645 -0.1999731 0.1818026 -0.1968465 0.1640805 0.1382996 -0.0521966 0.1614893 -0.0340597 0.1496156 -0.1172845 0.0514652 -0.2120546 0.0814019 -0.1374527 -0.0115356 -0.1076161 -0.0364725 0.1233678 0.0448046 -0.1479227 0.0911498 -0.0599838 1.0321949 -0.1841316 -0.2760384 -0.0496624 0.5564635 0.5505892 -0.0054182 0.5940909 0.6006603 0.0501089 -0.0859264 -0.0130484 -0.0241261 -0.0659984 -0.0882075 -0.0194557 -0.1436998 -0.0153995 0.0631136 0.078773 -0.0715484 0.0159313 0.0789457 0.023688 -0.0300448 0.0228115 0.0448305 0.0638686 0.0496416 0.070486 -0.0174285 0.0646732 -0.0774602 -0.0466842 -0.0514439 -0.0326052 0.1466493 0.0621149 -0.0390925 0.0844528 0.042547 -0.0248357 0.0267395 0.0175017 0.0510409 -0.0256144 -0.0641795 0.0171613 -0.0770125 0.0104214 0.0356831 -0.0241805 0.0312308 0.0689519 0.111451 0.0259012 -0.0258445 -0.0659924 0.089658 -0.2308474 -0.1855892 -0.0881839 0.0874212 -0.0367388 -0.0051019 0.0784794 -0.0111853 0.0539669 0.0061993 0.0705893 -0.0219774 0.0801603 0.4137525 -0.1120204 0.0228723 -0.0492506 0.1364992 -0.0148935 0.0971778 -0.060053 0.1250639 0.1478463 0.0310443 0.0053137 0.0465232 0.0252835 0.0426266 0.0016557 0.0412147 0.0140187 unknown
polarizability: 116.8465008|-6.6092097|81.7234335|6.2111931|2.3595486|75.443909 unknown
InChI: InChI=1S/C5H9NO2S/c1-9-3-2-4(6-9)5(7)8/h4,6H,2-3H2,1H3
charge 0 multiplicity 1
18 atoms
S  2.082478 0.001471 0.591971
O  -0.336129 -1.162046 -1.35645
O  -2.484953 -0.406267 -0.795225
N  0.383609 -0.144254 1.342757
C  0.126629 1.681589 -0.312813
C  -0.61362 0.509799 0.397752
C  1.449924 1.125031 -0.863327
C  2.229278 -1.705241 -0.205187
C  -1.211317 -0.473864 -0.671117
H  0.313329 2.513694 0.393827
H  -0.482694 2.062268 -1.151601
H  -1.43452 0.884938 1.038552
H  1.284389 0.44022 -1.709163
H  2.239156 1.873834 -1.029126
H  0.45187 0.389626 2.235596
H  3.153011 -1.693596 -0.805678
H  1.285682 -1.812801 -0.789747
H  2.298875 -2.412903 0.633279
