program: Gaussian 09
title: 000189036
version: EM64L-G09RevD.01
frameworkgroup: C1[X(C17H16Cl2N2O4)]
method: RPBEPBE
basis: SDD
operation: Freq
keyword: #p
keyword: freq=noraman
keyword: PBEPBE/SDD
title: #p freq=noraman PBEPBE/SDD
converged: YES YES NO NO
title: Mulliken charges:
elementType: Cl Cl O O O O N N C C C C C C C C C C C C C C C C C H H H H H H H H H H H H H H H H
charge: -0.052902 -0.033975 -0.415076 -0.373252 -0.201679 -0.205557 -0.457327 0.021076 0.161156 0.373499 -0.748320 -0.721247 -0.721268 -0.011807 -0.341224 0.174716 -0.226965 -0.292414 0.213495 0.652345 -0.385203 -0.273619 -0.387114 -0.383002 0.418099 0.227587 0.216699 0.216720 0.210278 0.208535 0.269283 0.208531 0.210206 0.269408 0.287785 0.224390 0.398884 0.329966 0.332680 0.313794 0.292814
chargesum: 0.00000
title: Mulliken charges with hydrogens summed into heavy atoms:
elementType: Cl Cl O O O O N N C C C C C C C C C C C C C C C C C
charge: -0.052902 -0.033975 -0.016192 -0.373252 -0.201679 -0.205557 -0.127360 0.021076 0.161156 0.373499 -0.087314 -0.033151 -0.033123 -0.011807 -0.053439 0.174716 -0.226965 -0.068024 0.213495 0.652345 -0.385203 0.059062 -0.073319 -0.090188 0.418099
polarizability: 4.58191115e+02 -1.25885350e+01 2.73488748e+02 -1.26144898e-01 4.84092486e-01 1.10106108e+02
1716.lowfreq: -7.6620 -0.0023 -0.0018 0.0011 2.5903 2.7442 12.5253 22.4693 45.9450
frequency: 12.4326 22.4609 45.9380 52.8910 63.2727 72.7940 106.5808 123.9870 125.2400 139.9345 156.5969 166.7189 169.7268 176.5474 197.5633 201.0765 244.3644 251.1615 287.0257 288.7902 324.4423 325.9453 327.3711 338.9078 354.7197 364.2009 398.7423 400.5995 404.4064 411.1454 447.9376 454.9850 463.0773 515.1351 515.5883 527.7555 531.6825 567.6115 597.8976 634.7120 675.1254 688.6191 692.4146 700.6584 714.7271 730.6071 745.8927 779.9860 781.2621 815.3231 835.7653 858.1469 860.3579 872.5122 903.6668 916.0941 918.7427 925.0584 937.5667 940.5781 951.0791 1011.9281 1020.4915 1022.2400 1032.7887 1098.3079 1099.1813 1128.8939 1140.3725 1181.3579 1201.5038 1205.4236 1218.2269 1240.6688 1247.1511 1260.2127 1285.2973 1302.9774 1339.0572 1362.1759 1374.0967 1377.0436 1386.5928 1391.7543 1404.2712 1408.9147 1420.3315 1429.0064 1457.0916 1466.5301 1472.8121 1476.8258 1481.1275 1490.8041 1506.1899 1530.1397 1562.9916 1579.1615 1588.4100 1609.1313 1625.5591 2744.0718 2970.5729 2980.4390 2983.8095 3064.1929 3068.4353 3069.1925 3078.4817 3114.6861 3117.6767 3141.4723 3184.2441 3187.2492 3189.9563 3205.6010 3490.6404
redmass: 9.9861 7.2269 9.6642 6.3838 5.4620 5.1430 5.7185 6.5477 11.2136 7.0033 6.2550 9.6421 5.1935 3.8185 7.0691 1.1392 1.7525 1.7637 3.4129 3.7135 3.5579 1.1815 7.6614 5.0674 10.3727 3.0564 7.2746 3.5033 3.6482 5.5823 3.5163 9.0614 7.6721 4.0484 2.9249 6.1639 3.9666 3.6733 5.4895 6.6075 2.0490 9.1472 5.3311 8.6551 3.5282 7.5651 3.4331 4.4053 5.2783 6.5765 1.6466 5.5907 4.4322 1.3836 1.4933 4.3909 1.4265 1.6712 1.7625 1.0702 1.2015 1.3237 1.9112 1.9724 1.3750 2.8450 3.0543 2.5438 1.3476 2.0506 2.9021 5.8055 2.8106 1.8053 2.9276 2.2213 3.3440 2.0872 2.4818 7.2198 1.1789 1.2159 4.1491 5.5722 1.4296 3.5487 4.2151 2.8004 1.0471 2.7205 1.0711 1.0481 1.0820 1.0502 1.0673 2.6437 5.3355 5.1514 4.1019 5.9163 3.0340 1.0723 1.0360 1.0366 1.0374 1.1004 1.0999 1.0994 1.0980 1.0981 1.0975 1.0921 1.0909 1.0911 1.0931 1.0957 1.0752
irintensity: 0.0520 0.1808 0.3407 1.5977 0.2822 2.6184 0.7909 0.5966 0.7585 5.0011 0.5752 1.8552 0.2766 0.2277 1.3522 0.0073 0.3184 0.0441 0.9080 1.2557 3.4364 0.1356 1.5652 2.3713 0.8435 0.6064 4.2289 2.9180 0.0838 7.0196 9.2296 23.6098 3.1852 5.9687 2.5430 2.0837 1.5683 1.1495 6.8654 4.9546 30.9758 22.6923 3.7149 56.2065 0.7988 43.5571 11.0401 35.9389 18.6697 9.4738 25.0574 3.6172 46.6089 28.1298 12.3734 2.8406 28.7912 3.0324 11.4157 128.7751 6.6511 2.0591 12.2078 1.5276 1.2058 47.6077 8.3787 46.6985 11.8369 145.7843 5.9280 822.1197 42.4053 163.6264 110.4659 36.9525 35.1510 178.7844 290.7603 116.9632 24.4840 27.6125 76.3440 290.1198 52.7348 48.3570 194.2346 115.9885 0.1046 29.2993 3.2320 0.0698 2.2418 12.2985 53.5949 787.0776 42.7943 1.4505 27.6225 314.0264 78.4173 561.5542 20.0697 42.2087 50.2122 5.4980 44.9937 14.5152 96.0186 0.3390 18.4040 3.6402 3.9312 0.1007 12.4756 9.2238 44.3393
temp: 298.150 k
press: 1.00000 atm
elementType: 17 17 8 8 8 8 7 7 6 6 6 6 6 6 6 6 6 6 6 6 6 6 6 6 6 1 1 1 1 1 1 1 1 1 1 1 1 1 1 1 1
symmnumber: 1
zpe: 790037.2 jmol-1
zpe.correction: 0.300909 hartree
zpe.thermalcorrener: 0.324672 hartree
zpe.thermalcorrenthalpy: 0.325616 hartree
zpe.thermalcorrgfe: 0.245893 hartree
zpe.sumelectzpe: -1986.072030 hartree
zpe.sumelectthermal: -1986.048268 hartree
zpe.sumelectthermalent: -1986.047324 hartree
zpe.sumelectthermalfe: -1986.127047 hartree
dipole: -4.9572 0.7903 0.0137
dipole: 5.0198
quadrupole: -197.5003 -166.8910 -161.8941
quadrupole: 9.6419 -0.0616 0.0279
quadrupole: -22.0719 8.5375 13.5344 9.6419 -0.0616 0.0279
hfenergy: -1986.3729398 hartree
pointgroup: C01 [X(C17H16Cl2N2O4)]
dipole: 1.9476896 0.3250925 -0.0351029 debye
polarizability: 457.8081942|14.1698363|273.1487404|-8.0746355|9.0102824|110.8290359 unknown
InChI: InChI=1S/C17H16Cl2N2O4/c1-17(2,3)12-7-9(18)6-11(15(12)22)16(23)20-14-5-4-10(21(24)25)8-13(14)19/h4-8,20,22H,1-3H3
charge 0 multiplicity 1
41 atoms
Cl 3.33927 3.954516 0.143375
Cl -2.627656 2.943603 0.173099
O  2.516973 -1.983976 -0.220275
O  0.047294 -1.635995 -0.122549
O  -6.898173 -1.841811 0.044384
O  -7.302242 0.403331 0.1614
N  -0.902998 0.491798 0.014594
N  -6.505788 -0.612391 0.093633
C  5.265192 -1.032358 -0.247082
C  4.034465 -0.100636 -0.146393
C  6.595596 -0.234007 -0.237306
C  5.202404 -1.842399 -1.579269
C  5.284755 -2.01007 0.968917
C  2.692458 -0.621131 -0.139516
C  4.181179 1.29788 -0.058514
C  1.549885 0.257768 -0.050932
C  3.060174 2.155029 0.031276
C  1.757019 1.666566 0.036259
C  0.200181 -0.352803 -0.054957
C  -2.269334 0.154917 0.030193
C  -3.226028 1.213997 0.103682
C  -2.764853 -1.180652 -0.022239
C  -4.602919 0.987514 0.125369
C  -4.14616 -1.4319 -0.001502
C  -5.050592 -0.351328 0.071658
H  7.437128 -0.945255 -0.314954
H  6.671452 0.462127 -1.093752
H  6.732827 0.338332 0.699393
H  5.214931 -1.164519 -2.453005
H  6.085249 -2.505083 -1.647688
H  4.295152 -2.464073 -1.626095
H  6.166743 -2.673239 0.893391
H  5.357349 -1.451824 1.920879
H  4.379245 -2.635525 0.993182
H  5.178492 1.741095 -0.058426
H  0.932775 2.38307 0.110129
H  1.496502 -2.169824 -0.198009
H  -0.719577 1.498659 0.058534
H  -2.042989 -1.995541 -0.079029
H  -5.326213 1.804182 0.181806
H  -4.533171 -2.453042 -0.041458
