program: Gaussian 09
title: 000189030
version: EM64L-G09RevD.01
frameworkgroup: C1[X(C18H18N3O3)]
method: RPBEPBE
basis: SDD
operation: Freq
keyword: #p
keyword: freq=noraman
keyword: PBEPBE/SDD
title: #p freq=noraman PBEPBE/SDD
converged: YES YES NO NO
title: Mulliken charges:
elementType: O O O N N N C C C C C C C C C C C C C C C C C C H H H H H H H H H H H H H H H H H H
charge: -0.245223 -0.325319 -0.345020 -0.392915 0.040134 0.111799 -0.195617 -0.622051 0.496672 0.306194 -0.435624 -0.383733 0.388416 -0.221027 -0.222210 -0.243765 -0.484865 -0.224445 0.468729 -0.361401 -0.363818 -0.219496 -0.221644 -0.220746 0.329770 0.253661 0.256825 0.369604 0.240688 0.230741 0.245915 0.244022 0.247458 0.248597 0.370882 0.249675 0.408966 0.240970 0.250092 0.243086 0.240185 0.245836
chargesum: 1.00000
title: Mulliken charges with hydrogens summed into heavy atoms:
elementType: O O O N N N C C C C C C C C C C C C C C C C C C
charge: -0.245223 0.083647 -0.345020 -0.023310 0.040134 0.111799 0.134153 -0.111566 0.496672 0.306194 -0.194936 -0.152992 0.388416 0.024888 0.021812 0.127117 0.011191 0.025230 0.468729 -0.120431 -0.113726 0.023590 0.018542 0.025091
polarizability: 3.71611063e+02 9.06086748e+01 2.64530430e+02 2.57112832e+00 -2.19757601e+01 1.84919257e+02
1716.lowfreq: -8.6285 -4.4117 -0.0006 -0.0004 0.0005 7.0715 14.0276 17.3854 26.9607
frequency: 13.7418 17.2519 26.9473 36.4029 37.7853 46.5705 51.3268 64.5052 107.1875 124.0692 128.3709 151.9372 174.6218 190.7848 223.8205 257.1904 261.5083 293.4594 306.4027 342.9313 357.7484 402.3022 402.6817 413.7262 425.2039 432.5834 495.1598 518.6540 528.1296 549.4997 569.3411 578.5860 597.5869 616.0356 616.3793 642.9450 673.2124 695.6459 701.4040 708.7414 724.9725 748.9959 763.1902 803.8019 817.6830 818.2584 854.2378 856.6757 862.7463 891.2705 902.1903 927.1735 937.7559 961.2510 981.5814 984.6393 989.2582 990.4873 995.0134 998.6831 1008.7253 1008.8996 1026.4210 1026.5295 1045.0789 1091.0823 1093.7967 1109.7461 1137.7376 1179.1502 1180.0046 1182.9993 1190.7746 1191.7167 1213.4856 1222.4344 1228.8765 1241.4588 1255.3293 1283.4719 1317.7945 1331.2754 1335.5193 1344.8230 1348.5118 1385.7547 1388.6949 1395.9091 1443.9181 1444.2848 1459.6719 1462.3015 1472.9349 1484.9130 1485.2217 1540.7788 1548.7002 1591.9904 1592.2075 1609.9476 1610.9796 2045.0146 2619.5484 2980.7529 3015.8011 3054.3633 3075.6191 3109.4427 3113.3995 3128.9643 3133.4065 3135.4772 3145.3494 3145.4083 3157.0603 3157.9137 3172.8125 3174.6656 3496.0064 3508.4461
redmass: 4.6889 5.6889 5.5468 4.1933 4.5713 5.6422 5.4787 6.9600 8.1466 5.2256 5.2855 6.9805 6.5268 5.6729 5.5423 7.1317 5.6712 7.3883 4.7073 2.2262 2.1741 2.8140 2.7863 4.5742 4.8245 4.2502 4.2279 3.6369 4.6577 3.9352 1.2730 2.3095 2.4832 6.2931 6.3487 4.9778 4.9335 4.1852 1.8920 2.1770 5.2311 2.1847 1.8861 4.5754 3.9638 3.4870 1.2701 1.2477 2.5007 1.7091 2.0222 1.4527 1.4363 1.8992 1.3936 1.4271 5.7907 5.8903 3.9309 2.9464 1.3340 1.3403 2.2249 2.2199 2.0185 1.7637 1.5177 2.4777 2.6777 1.0559 1.1059 1.2591 1.1143 1.1200 2.5615 1.5224 1.7929 1.5767 1.8840 1.3907 1.3280 1.2691 1.2678 1.4490 1.3264 7.0199 8.4121 2.3425 2.0904 2.1757 1.1334 1.2761 1.8635 2.2297 2.3295 6.7823 3.6814 5.9204 5.9779 6.0494 6.0069 13.3876 1.1043 1.0826 1.0609 1.0589 1.1026 1.0899 1.0895 1.0893 1.0899 1.1058 1.0917 1.0889 1.0949 1.0962 1.1016 1.1011 1.0668 1.0780
irintensity: 0.4972 0.1641 0.0094 0.4080 0.4877 0.3288 0.0672 0.7926 5.2216 1.2289 1.0969 9.5419 1.3155 1.4237 7.9592 24.4875 14.1427 33.5054 0.8449 1.4676 13.2687 0.3508 0.0084 19.9573 4.0193 12.8115 39.4083 18.8588 31.2551 41.3282 14.6718 136.7933 42.5901 0.4475 0.3246 5.6730 8.5452 0.6893 62.9622 17.7112 60.0107 231.6604 3.0093 66.1459 1.9067 3.7801 0.2161 1.3522 11.3863 184.5963 41.2478 3.8443 1.5198 9.3881 0.1958 0.3621 6.3116 7.8473 3.2254 104.8466 0.0687 0.8184 2.9600 4.0536 109.5380 24.4362 5.4342 8.7948 57.5021 0.0145 32.8912 140.8624 6.3969 6.5247 6.2032 14.4076 43.9130 5.0542 301.0265 70.2864 5.9838 0.9949 11.0995 4.2984 14.7521 4.6665 2.6794 139.9394 7.6945 10.5706 12.6386 162.3231 225.3182 8.9797 8.8752 244.8203 219.4531 3.4375 1.6415 11.3702 18.8778 857.1270 445.1175 8.7922 6.3187 19.5579 4.6904 8.6021 6.7141 2.7528 1.2418 3.5710 5.0972 0.6797 14.4135 21.5445 18.0654 16.3477 98.6495 96.1249
temp: 298.150 k
press: 1.00000 atm
elementType: 8 8 8 7 7 7 6 6 6 6 6 6 6 6 6 6 6 6 6 6 6 6 6 6 1 1 1 1 1 1 1 1 1 1 1 1 1 1 1 1 1 1
symmnumber: 1
zpe: 858174.4 jmol-1
zpe.correction: 0.326861 hartree
zpe.thermalcorrener: 0.349013 hartree
zpe.thermalcorrenthalpy: 0.349957 hartree
zpe.thermalcorrgfe: 0.270923 hartree
zpe.sumelectzpe: -1084.627015 hartree
zpe.sumelectthermal: -1084.604863 hartree
zpe.sumelectthermalent: -1084.603919 hartree
zpe.sumelectthermalfe: -1084.682953 hartree
dipole: -9.1686 -2.5256 -0.1628
dipole: 9.5114
quadrupole: -58.8582 -113.0190 -121.9959
quadrupole: 21.1469 -0.2800 -2.0347
quadrupole: 39.0995 -15.0613 -24.0382 21.1469 -0.2800 -2.0347
hfenergy: -1084.953876 hartree
pointgroup: C01 [X(C18H18N3O3)]
dipole: -2.9408511 -2.247007 0.5528038 debye
polarizability: 289.0310272|105.7823325|305.4273163|-24.5673452|-62.8684023|226.6024068 unknown
InChI: InChI=1S/C18H18N3O3/c19-20-12-17(22)16(11-14-7-3-1-4-8-14)21-18(23)24-13-15-9-5-2-6-10-15/h1-10,12,16,21-22H,11,13H2
charge 1 multiplicity 1
42 atoms
O  1.345543 -1.336961 -0.776907
O  -4.074218 -1.898167 0.011616
O  0.280839 -1.642558 1.292295
N  -0.879215 -0.903403 -0.605145
N  -2.826492 -3.685046 2.040429
N  -3.20401 -4.664276 2.558862
C  -2.086352 -0.484698 0.136034
C  -2.947623 0.483165 -0.722798
C  -2.144447 1.706804 -1.14664
C  -2.860494 -1.73363 0.588878
C  -1.740083 1.867314 -2.496566
C  -1.776158 2.693823 -0.195804
C  0.266707 -1.310459 0.052754
C  -0.977534 2.991306 -2.889702
C  -1.014116 3.815716 -0.586189
C  -2.262443 -2.571055 1.53945
C  2.702559 -1.731149 -0.166437
C  -0.609761 3.965281 -1.934164
C  3.420681 -0.527968 0.381174
C  4.208105 0.284236 -0.476114
C  3.329976 -0.204293 1.760338
C  4.889593 1.408771 0.036316
C  4.014824 0.918741 2.273192
C  4.79415 1.726748 1.412083
H  -1.764721 0.037203 1.060654
H  -3.827244 0.777903 -0.122751
H  -3.333375 -0.054634 -1.607061
H  -0.778326 -0.580175 -1.572929
H  -2.04827 1.131533 -3.251498
H  -2.101643 2.600712 0.848723
H  -0.680424 3.110123 -3.936833
H  -0.743026 4.576111 0.153584
H  3.205341 -2.173058 -1.039152
H  2.497584 -2.493688 0.602616
H  -1.192477 -2.318007 1.813892
H  -0.02303 4.838484 -2.237466
H  -4.591971 -2.709918 0.26436
H  4.290238 0.033124 -1.540552
H  2.726155 -0.83335 2.424487
H  5.500752 2.028534 -0.627986
H  3.950864 1.159147 3.339643
H  5.33174 2.593413 1.811618
