program: Gaussian 09
title: 000189028
version: EM64L-G09RevD.01
frameworkgroup: C1[X(C6H10O3)]
method: RPBEPBE
basis: SDD
operation: Freq
keyword: #pfreq=noraman
keyword: PBEPBE/SDD
title: #p freq=noraman PBEPBE/SDD
converged: YES YES NO NO
title: Mulliken charges:
elementType: O O O C C C C C C H H H H H H H H H H
charge: -0.187168 -0.399996 -0.240261 -0.241784 0.205447 -0.473395 -0.723748 0.172420 -0.680046 0.284337 0.240901 0.273989 0.236025 0.232062 0.248448 0.214238 0.233679 0.226162 0.378690
chargesum: 0.00000
title: Mulliken charges with hydrogens summed into heavy atoms:
elementType: O O O C C C C C C
charge: -0.187168 -0.021306 -0.240261 0.042553 0.205447 0.041495 -0.007212 0.172420 -0.005967
polarizability: 8.19646974e+01 2.24406413e+00 6.55252099e+01 9.63828294e-01 -1.08516781e+00 7.31815154e+01
1716.lowfreq: -15.4732 -10.3049 -1.2626 -0.0005 -0.0002 0.0001 32.0424 49.2508 61.2019
frequency: 31.7256 49.2221 61.0228 146.0696 183.4644 193.6033 233.2871 238.9243 277.8990 356.5819 432.6018 500.8516 575.9551 612.0628 635.9043 708.1524 743.9907 800.6354 831.1053 947.3007 1008.0840 1018.3057 1044.7711 1078.2840 1083.8416 1105.9889 1140.9528 1233.1231 1244.0603 1281.1919 1340.3079 1352.6559 1392.1246 1395.5346 1439.7840 1470.2388 1473.5733 1479.9507 1485.2960 1627.0258 1650.9220 2970.0533 2997.6188 2998.0339 3020.8666 3074.2160 3093.3640 3094.2879 3101.2360 3110.1948 3504.6975
redmass: 7.5725 4.8362 2.1917 2.2108 1.8928 1.9119 1.3000 2.3999 3.0171 5.1845 5.5738 2.9070 2.4093 2.8529 1.5573 3.5602 2.7372 1.9154 2.2112 1.9305 1.6917 2.2558 2.0202 1.9478 1.9486 2.6038 2.5564 1.3189 1.3035 1.3214 1.6799 1.8201 1.1938 1.2021 1.0919 1.0404 1.0468 1.0508 1.0483 8.4086 7.9702 1.0633 1.0351 1.0359 1.0945 1.0870 1.1004 1.1004 1.0999 1.0997 1.0639
irintensity: 3.7388 4.0206 0.6199 0.4434 0.9719 0.7205 1.0404 4.2692 2.5712 14.9235 9.7417 6.8553 24.8878 44.2941 108.2850 15.8637 5.2627 4.4176 11.9266 55.2497 18.7542 58.6228 232.6341 5.6333 32.9750 21.4999 58.3376 0.2442 1.9107 3.7378 73.7424 26.3447 16.2622 22.5194 36.4618 13.0329 15.6243 12.8780 12.2629 274.4467 72.6095 14.5047 23.5457 22.5125 1.4458 0.5095 16.3447 31.2703 24.3648 16.8345 28.4718
temp: 298.150 k
press: 1.00000 atm
elementType: 8 8 8 6 6 6 6 6 6 1 1 1 1 1 1 1 1 1 1
symmnumber: 1
zpe: 399977.1 jmol-1
zpe.correction: 0.152343 hartree
zpe.thermalcorrener: 0.162999 hartree
zpe.thermalcorrenthalpy: 0.163943 hartree
zpe.thermalcorrgfe: 0.114991 hartree
zpe.sumelectzpe: -459.597499 hartree
zpe.sumelectthermal: -459.586843 hartree
zpe.sumelectthermalent: -459.585898 hartree
zpe.sumelectthermalfe: -459.634851 hartree
dipole: -0.9367 0.9163 -1.4233
dipole: 1.9346
quadrupole: -50.4060 -48.1499 -64.2950
quadrupole: 2.7469 -5.9168 -0.2417
quadrupole: 3.8776 6.1337 -10.0114 2.7469 -5.9168 -0.2417
hfenergy: -459.7498419 hartree
pointgroup: C01 [X(C6H10O3)]
dipole: -0.4394847 -0.1152671 -0.6106445 debye
dipolederiv: -0.7207447 -0.0701338 -0.1407654 -0.0659708 -0.4443115 -0.2431113 -0.2510258 -0.2857287 -0.5989195 -0.6555762 0.045018 0.3995113 -0.0144571 -0.2445958 0.0774757 0.4933493 0.0286367 -1.0142879 -0.4696628 -0.1564775 0.0586973 -0.1640352 -0.8099835 -0.3137402 0.1241538 -0.118031 -0.6747544 -0.6707402 -0.2166268 -0.0015165 -0.2120481 -0.1561873 0.0450364 0.0296211 0.0676853 -0.0738415 1.3384148 0.0219396 0.1098157 -0.1472723 0.3222637 0.4268567 0.1900653 0.469205 0.6245979 -0.1615679 0.075425 0.06008 0.0985463 -0.0395373 -0.1941291 0.1152634 -0.2539804 -0.1748454 0.0450686 0.0045281 -0.0128378 -0.0087202 0.0615861 0.007335 0.0236017 -0.0607084 0.0557281 0.7064814 0.3437858 -0.5393491 0.5840224 1.0370322 0.2268741 -0.6999842 0.116106 1.2615304 -0.0132555 0.014862 -0.0320539 0.0392284 0.0632022 0.0040066 -0.00409 0.0174462 0.0728317 0.0420677 0.0323341 0.0072058 0.0344526 0.017404 -0.0400138 0.0223238 -0.0518354 -0.0080743 0.0780539 0.0469369 -0.0059812 0.0329144 0.0272153 0.1021674 -0.0448312 0.0901991 -0.0423516 0.030203 -0.0596372 -0.014242 -0.0547254 0.0234489 -0.0344092 -0.0318309 0.0106455 0.1161847 -0.1237594 0.0863057 -0.0496634 0.0597746 0.084401 0.0231756 -0.0170836 0.0201756 0.064514 0.036791 -0.1228866 0.0372737 -0.0933264 -0.0387194 0.0546169 0.0099412 0.0505642 0.0496861 0.100045 0.0356764 0.0359978 0.0402767 -0.0088027 -0.1102972 0.0300628 -0.0516259 0.0033288 -0.0060341 0.0717551 0.0604761 0.103229 0.0137515 -0.0962145 0.0978142 -0.1094238 -0.0275089 0.0153245 -0.0644736 -0.0100613 -0.1327234 -0.058312 -0.0110976 -0.0470001 -0.0116092 0.0980747 0.0603099 -0.0066239 0.0241288 0.0058606 0.0314232 0.0947784 -0.0335258 0.1253848 -0.0763374 0.368581 -0.0817072 0.013284 -0.1050261 0.1187214 -0.0193099 -0.006825 -0.0531055 0.3444446 unknown
polarizability: 81.2806187|3.5123074|68.0442944|-2.1975407|3.1908713|71.3465096 unknown
InChI: InChI=1S/C6H10O3/c1-3-5(7)4(2)6(8)9/h4,8H,3H2,1-2H3
charge 0 multiplicity 1
19 atoms
O  1.418795 1.203899 1.737032
O  -2.085811 -0.377022 2.079836
O  -1.488707 -1.452347 0.11034
C  -0.682361 0.853309 0.548271
C  0.847069 0.624911 0.780581
C  1.584143 -0.284253 -0.197771
C  -0.977279 1.329032 -0.898714
C  -1.437858 -0.436354 0.841676
C  3.014812 -0.632343 0.248644
H  -0.993716 1.610225 1.285964
H  1.603443 0.233598 -1.179977
H  0.970391 -1.191054 -0.367609
H  -2.037835 1.62002 -0.994668
H  -0.358829 2.208488 -1.149068
H  -0.777872 0.527006 -1.628485
H  3.514421 -1.258512 -0.511391
H  3.613658 0.280948 0.403736
H  3.007789 -1.184441 1.204456
H  -2.544354 -1.244313 2.255144
