program: Gaussian 09
title: 000189018
version: EM64L-G09RevD.01
frameworkgroup: C1[X(C13H18N2O4)]
method: RPBEPBE
basis: SDD
operation: Freq
keyword: #p
keyword: freq=noraman
keyword: PBEPBE/SDD
title: #p freq=noraman PBEPBE/SDD
converged: YES YES NO NO
title: Mulliken charges:
elementType: O O O O N N C C C C C C C C C C C C C H H H H H H H H H H H H H H H H H H
charge: -0.276655 -0.245879 -0.201173 -0.202075 -0.109257 0.027394 -0.372645 -0.336581 -0.329494 -0.305512 -0.666957 -0.669908 0.199224 0.234640 -0.321481 -0.310957 0.387840 -0.349741 -0.344565 0.235992 0.219591 0.224465 0.195151 0.209434 0.193337 0.244521 0.235620 0.207380 0.225335 0.210949 0.207588 0.228353 0.210758 0.281996 0.282622 0.291093 0.289595
chargesum: 0.00000
title: Mulliken charges with hydrogens summed into heavy atoms:
elementType: O O O O N N C C C C C C C C C C C C C
charge: -0.276655 -0.245879 -0.201173 -0.202075 -0.109257 0.027394 0.082938 0.083035 0.073277 0.174629 -0.023293 -0.023209 0.199224 0.234640 -0.039485 -0.028334 0.387840 -0.058648 -0.054969
polarizability: 3.32210658e+02 -4.46795285e+00 1.72085290e+02 9.90903699e+00 1.29926081e+01 1.04352871e+02
1716.lowfreq: -6.0521 -4.1537 -0.0008 -0.0006 -0.0004 5.1070 17.2831 20.9639 23.0077
frequency: 16.6084 20.8266 22.7172 50.6598 60.6980 66.7145 79.1990 87.9387 90.9833 115.1514 167.4299 195.3063 218.2100 233.7091 254.0943 271.9591 282.4536 294.5700 317.8159 360.7805 389.6798 410.0468 435.6483 457.9122 464.3380 484.7556 512.5950 529.1732 623.0800 651.9247 677.0980 685.0484 744.9095 748.6670 764.2806 790.2893 794.4469 797.2553 814.7677 864.3210 888.7035 893.5845 917.3443 990.4620 1004.3265 1004.9474 1011.7466 1047.3612 1060.2763 1070.4929 1075.6136 1079.7031 1084.8372 1090.0503 1108.9978 1124.3583 1175.6819 1184.6035 1208.9874 1214.7425 1244.1219 1249.5269 1282.3745 1292.8244 1293.1409 1299.4863 1330.0257 1363.8432 1367.8682 1368.9163 1383.0998 1388.2013 1389.2291 1405.3690 1414.3605 1447.3889 1462.8730 1463.9928 1472.2752 1474.5219 1480.2763 1486.0267 1487.3812 1491.4660 1588.8703 1608.5927 1620.0253 2862.9489 2872.4771 2920.2801 2981.6363 2985.0054 3025.7885 3036.8258 3041.2481 3054.2613 3074.1403 3078.4465 3091.2375 3091.9348 3132.5174 3164.8071 3176.0171 3187.8658 3193.6913
redmass: 4.2413 5.2330 4.8668 6.0561 3.1857 4.3300 3.7574 4.1181 3.1202 3.2356 1.6637 2.1148 1.8152 3.4050 2.9240 2.7432 3.4952 2.3212 4.1220 4.6582 2.9676 2.8869 3.2385 3.9128 3.2121 7.1947 5.8112 4.4898 7.1148 6.2433 6.7720 3.9438 2.6975 3.4501 5.1154 2.3273 1.1619 1.3787 1.9643 1.2441 1.7006 6.5932 1.9724 2.2194 1.5355 2.5725 1.3679 3.5801 2.7267 2.2125 2.4448 2.1841 2.1792 3.3091 1.3219 1.7133 1.2547 1.7517 2.3028 6.4296 3.6156 1.4992 1.1527 1.2271 1.2560 1.1764 1.3269 1.3335 7.5602 1.3360 1.3322 1.2454 1.2447 8.3013 4.5041 1.0963 1.0535 1.0546 1.0549 2.3919 1.0473 1.0732 1.0764 1.0782 8.7370 6.4129 9.5374 1.0720 1.0712 1.0695 1.0358 1.0356 1.0888 1.0878 1.0626 1.0881 1.0980 1.0983 1.1004 1.1004 1.1079 1.0901 1.0890 1.0958 1.0973
irintensity: 0.2714 0.0246 0.3035 0.5674 0.0419 0.2712 0.1844 3.3429 2.2167 0.9723 5.1807 1.2572 1.2572 3.4642 1.7695 5.1008 4.7775 2.2654 13.3019 2.1132 8.6400 0.0392 10.8467 1.5951 6.9502 8.1210 0.7776 3.3350 0.3371 1.3219 1.7254 62.8526 7.1149 18.5777 4.4073 26.0871 9.7367 1.9707 4.0057 0.6445 56.8634 20.7384 3.7196 3.0377 7.9342 30.0579 0.0215 78.9752 78.7510 128.8201 17.4079 41.5866 3.9414 13.4798 10.6815 6.0784 4.1031 22.2083 129.6846 492.3669 81.8517 49.3102 4.3611 27.3291 2.7371 8.9803 15.4149 19.9077 84.3528 15.8482 3.2604 24.3545 20.8284 9.4394 59.7223 13.1217 3.9317 4.1351 5.2245 2.9506 2.9762 24.2720 11.7513 9.5731 47.5829 15.2883 99.7843 50.8712 155.3858 43.5363 29.4618 37.7302 9.6683 17.0294 25.5011 20.4058 64.9464 57.8289 26.8424 55.8386 11.3258 1.1652 1.1147 0.4582 0.4821
temp: 298.150 k
press: 1.00000 atm
elementType: 8 8 8 8 7 7 6 6 6 6 6 6 6 6 6 6 6 6 6 1 1 1 1 1 1 1 1 1 1 1 1 1 1 1 1 1 1
symmnumber: 1
zpe: 778841.3 jmol-1
zpe.correction: 0.296645 hartree
zpe.thermalcorrener: 0.316453 hartree
zpe.thermalcorrenthalpy: 0.317397 hartree
zpe.thermalcorrgfe: 0.244408 hartree
zpe.sumelectzpe: -915.041564 hartree
zpe.sumelectthermal: -915.021756 hartree
zpe.sumelectthermalent: -915.020812 hartree
zpe.sumelectthermalfe: -915.093801 hartree
dipole: 5.6425 0.7104 -0.1447
dipole: 5.6889
quadrupole: -141.9806 -112.4054 -112.4479
quadrupole: 6.7597 -5.5954 0.6658
quadrupole: -19.7026 9.8725 9.8301 6.7597 -5.5954 0.6658
hfenergy: -915.3382088 hartree
pointgroup: C01 [X(C13H18N2O4)]
dipole: -2.2144816 0.3245081 0.0133736 debye
polarizability: 332.5822842|3.4125611|160.7731912|4.8395611|-28.4519358|115.2933438 unknown
InChI: InChI=1S/C13H18N2O4/c1-3-14(4-2)9-10-19-13(16)11-5-7-12(8-6-11)15(17)18/h5-8H,3-4,9-10H2,1-2H3
charge 0 multiplicity 1
37 atoms
O  -0.89164 0.195198 -0.831876
O  -0.680807 -1.788725 0.383498
O  6.249182 -0.498382 0.7057
O  5.936167 1.427045 -0.476368
N  -4.519964 0.3308 0.24311
N  5.499921 0.351309 0.08771
C  -3.066928 0.592128 0.332606
C  -4.914815 -0.973951 0.844357
C  -5.371927 1.472714 0.665727
C  -2.372223 -0.010187 -0.904989
C  -6.171405 -1.581003 0.192681
C  -5.381971 2.624246 -0.357349
C  -0.165774 -0.768015 -0.137423
C  1.296107 -0.444641 -0.101124
C  2.15954 -1.352249 0.565954
C  1.8217 0.726295 -0.706956
C  4.040124 0.07362 0.021961
C  3.541174 -1.098427 0.632493
C  3.202391 0.992073 -0.648521
H  -2.614192 0.16485 1.256259
H  -2.881828 1.680504 0.351226
H  -4.070124 -1.675709 0.711965
H  -5.069306 -0.876983 1.948099
H  -6.403771 1.093619 0.777458
H  -5.066861 1.860666 1.670083
H  -2.680326 0.511207 -1.822952
H  -2.577181 -1.091375 -0.986738
H  -7.05532 -0.928423 0.311777
H  -6.005124 -1.733001 -0.888004
H  -6.411296 -2.556157 0.655855
H  -4.373891 3.053226 -0.506557
H  -5.74589 2.261547 -1.334359
H  -6.043032 3.44117 -0.012793
H  1.726851 -2.247132 1.023605
H  1.142955 1.413338 -1.217959
H  4.231097 -1.777589 1.139451
H  3.638985 1.883893 -1.105009
