program: Gaussian 09
title: 000189014
version: EM64L-G09RevD.01
frameworkgroup: C1[X(C19H22O2)]
method: RPBEPBE
basis: SDD
operation: Freq
keyword: #pfreq=noraman
keyword: PBEPBE/SDD
title: #p freq=noraman PBEPBE/SDD
converged: YES YES NO NO
title: Mulliken charges:
elementType: O O C C C C C C C C C C C C C C C C C C C H H H H H H H H H H H H H H H H H H H H H H
charge: -0.177213 -0.436912 -0.157724 -0.095452 0.302026 -0.170148 -0.526014 -0.484380 -0.685312 -0.509759 -0.125622 0.249727 -0.794611 0.532427 -0.585717 0.318656 -0.346883 -0.752993 -0.582338 -0.410909 0.293552 0.233441 0.235954 0.209989 0.214659 0.225830 0.223498 0.199018 0.238400 0.227288 0.219247 0.219101 0.229737 0.241843 0.235209 0.222443 0.225638 0.225833 0.233544 0.260610 0.223055 0.249759 0.351501
chargesum: 0.00000
title: Mulliken charges with hydrogens summed into heavy atoms:
elementType: O O C C C C C C C C C C C C C C C C C C C
charge: -0.177213 -0.085410 0.075717 0.140502 0.302026 0.039841 -0.085526 -0.061863 -0.219623 -0.071411 -0.125622 0.249727 -0.087822 0.532427 -0.137636 0.318656 -0.121050 -0.258839 -0.359283 -0.161150 0.293552
polarizability: 2.83649911e+02 -9.84344171e+00 2.02616688e+02 1.07462666e+01 5.09265359e+00 1.25425097e+02
1716.lowfreq: -15.4076 -8.1948 0.0005 0.0006 0.0007 5.4680 28.8653 55.9751 77.6693
frequency: 28.7153 55.9613 77.6679 96.0606 111.1169 158.9188 163.0586 204.1367 215.1851 226.6622 234.7969 258.9265 270.7613 283.0436 300.2931 334.8871 348.5051 355.7140 364.9555 390.6372 401.5539 432.3748 438.6676 457.2062 483.7249 506.6112 519.1018 536.1070 559.1959 598.9624 605.3872 629.0463 648.4788 698.1224 711.8631 725.4715 781.0854 790.1789 811.4985 825.7092 826.2585 841.1914 859.6637 886.4774 904.7454 911.7744 920.8844 935.8955 951.6481 974.8493 983.6299 991.2362 1005.4085 1018.2479 1023.2812 1055.7494 1069.7725 1090.3043 1102.1086 1120.1906 1127.1851 1133.9898 1136.9283 1156.9862 1161.5396 1174.6800 1185.5069 1206.8890 1217.2970 1227.8834 1242.3198 1244.6476 1255.9787 1259.8810 1275.3350 1287.4499 1293.4939 1295.2313 1314.8864 1324.5951 1329.8215 1338.1252 1341.6959 1354.8230 1377.9216 1382.6105 1385.8146 1414.2088 1427.0745 1455.8615 1456.7546 1463.8586 1469.9841 1472.9865 1482.7663 1489.8181 1500.8838 1601.3665 1616.3540 1620.0705 1673.0427 2899.4472 2917.6838 2956.2965 2960.0780 2972.2696 2976.4270 2979.4450 2986.4378 2990.8864 3016.2910 3034.4646 3038.5419 3049.1273 3054.5370 3078.9631 3087.1314 3091.7764 3095.3739 3143.7026 3172.1180 3196.1101 3580.3748
redmass: 4.6167 4.5438 3.8509 4.2631 4.7957 1.8941 3.7860 1.8455 3.3740 1.7526 3.8328 3.2846 3.0036 3.3758 3.0069 2.9303 1.1243 3.4279 2.7592 3.2616 3.5211 3.9533 2.7452 4.0912 2.6415 3.4169 3.8842 3.9618 2.7583 2.5727 3.4472 2.7475 1.8592 2.9855 3.9276 4.2407 2.6750 2.5898 2.1560 1.9907 1.5711 1.7152 1.9045 2.5100 2.5554 1.9446 2.3357 1.7659 1.3761 1.6525 1.8703 1.6434 2.1706 2.2154 1.9572 3.2461 2.7462 1.8235 2.2301 2.2220 1.8618 1.3616 1.5815 2.0697 1.4809 1.4480 1.4998 1.8463 1.7672 1.8011 1.5920 1.4555 2.1685 2.1699 1.6442 1.4231 1.5992 1.3907 1.3722 1.3292 1.5403 1.5874 1.4496 1.5884 1.4638 2.2450 1.6646 1.1764 3.3775 1.0869 1.1154 1.0773 1.0916 1.0831 1.0674 1.0612 2.7422 6.5873 10.7184 6.6102 6.7454 1.0800 1.0805 1.0644 1.0774 1.0678 1.0646 1.0622 1.0577 1.0404 1.0939 1.1019 1.0976 1.1020 1.0968 1.0992 1.0609 1.0907 1.0981 1.0875 1.0960 1.1151 1.0659
irintensity: 0.2645 0.2044 2.9746 1.0515 0.6035 0.3018 0.0961 0.6202 1.3852 1.2312 0.2562 1.9438 1.9242 4.0934 1.9080 1.0168 136.6171 6.5379 0.0277 2.0407 0.4078 0.6846 10.6835 24.0370 1.4121 1.2992 2.0217 0.4189 6.0842 2.1850 2.5233 4.6170 2.5572 3.4481 3.3083 2.4071 10.1864 0.5067 6.5641 2.3301 7.5737 20.4902 25.6565 4.7667 36.2112 3.7256 0.3880 4.3719 0.3437 22.2578 12.3481 54.6115 86.6598 6.7511 1.5846 7.7589 2.0207 0.2223 4.9031 2.3043 59.9478 38.2130 163.5498 6.5179 3.9316 19.9122 7.1538 4.6108 2.0913 12.3560 5.3250 0.5832 45.3409 16.9296 6.5698 3.9711 10.2552 1.0869 0.7306 0.4042 6.4432 3.1920 1.5385 1.2587 10.0853 14.3403 6.6583 28.8371 41.2659 2.0596 10.3133 12.5133 7.1302 7.9369 11.5281 9.2709 83.0942 9.9168 136.4533 65.8487 13.3520 14.2477 14.1440 27.7731 8.0429 39.3397 10.6944 41.1076 22.7441 31.8428 35.6911 48.2577 34.6299 44.8118 32.5492 20.2865 10.8367 25.7973 26.7818 10.6948 10.7974 4.4549 37.2556
temp: 298.150 k
press: 1.00000 atm
elementType: 8 8 6 6 6 6 6 6 6 6 6 6 6 6 6 6 6 6 6 6 6 1 1 1 1 1 1 1 1 1 1 1 1 1 1 1 1 1 1 1 1 1 1
symmnumber: 1
zpe: 948457.4 jmol-1
zpe.correction: 0.361248 hartree
zpe.thermalcorrener: 0.379640 hartree
zpe.thermalcorrenthalpy: 0.380584 hartree
zpe.thermalcorrgfe: 0.315942 hartree
zpe.sumelectzpe: -886.117915 hartree
zpe.sumelectthermal: -886.099523 hartree
zpe.sumelectthermalent: -886.098579 hartree
zpe.sumelectthermalfe: -886.163220 hartree
dipole: 1.4116 4.2012 0.8148
dipole: 4.5063
quadrupole: -141.7425 -118.0593 -125.9962
quadrupole: -2.0790 -0.3912 0.8868
quadrupole: -13.1432 10.5400 2.6031 -2.0790 -0.3912 0.8868
hfenergy: -886.4791629 hartree
pointgroup: C01 [X(C19H22O2)]
dipole: 0.5484534 -1.6512728 -0.3400893 debye
polarizability: 283.6463565|9.6928202|202.4299385|-11.1454249|5.9229876|125.6154012 unknown
InChI: InChI=1S/C19H22O2/c1-11-9-17-16-5-3-12-10-13(20)4-6-14(12)15(16)7-8-19(17,2)18(11)21/h4,6,10,15-17,20H,1,3,5,7-9H2,2H3
charge 0 multiplicity 1
43 atoms
O  -4.684273 1.542234 0.32506
O  6.224626 0.036341 -0.303496
C  -1.77487 -0.547628 0.280957
C  -0.295014 -0.716587 -0.097004
C  -2.36454 0.79463 -0.260112
C  0.503696 0.471533 0.53197
C  -1.614434 1.973652 0.390223
C  -0.085788 1.85898 0.133941
C  -2.830055 -1.61799 -0.116186
C  0.320817 -2.048242 0.381578
C  -3.854298 0.624077 0.094268
C  2.011797 0.334353 0.262225
C  -2.331305 0.911419 -1.81912
C  -4.146159 -0.864747 0.083054
C  1.751759 -2.201427 -0.171202
C  2.594237 -0.934378 -0.029619
C  2.878078 1.45779 0.352035
C  -5.396501 -1.362655 0.25754
C  3.994398 -1.040502 -0.220012
C  4.26869 1.356622 0.16265
C  4.828479 0.093429 -0.125742
H  -1.814448 -0.472963 1.392778
H  -0.191741 -0.675573 -1.202864
H  0.356113 0.375762 1.634116
H  -1.808656 1.968402 1.481885
H  -1.992199 2.939716 0.006198
H  0.144957 2.061705 -0.930326
H  0.41484 2.656531 0.714034
H  -2.776261 -2.53131 0.501439
H  -2.704627 -1.928656 -1.173191
H  -0.29653 -2.905566 0.051356
H  0.334287 -2.064514 1.490722
H  -2.824454 0.057424 -2.317229
H  -2.863288 1.830593 -2.12371
H  -1.298044 0.972834 -2.198695
H  1.692524 -2.467493 -1.247756
H  2.267201 -3.046959 0.32449
H  2.462833 2.444768 0.578522
H  -5.608113 -2.438022 0.257999
H  -6.23658 -0.673865 0.410305
H  4.429984 -2.025763 -0.441732
H  4.923933 2.229289 0.235745
H  6.51473 -0.888748 -0.500389
