program: Gaussian 09
title: 000196955
version: EM64L-G09RevD.01
frameworkgroup: C1[X(C21H14O8)]
method: RPBEPBE
basis: SDD
operation: Freq
keyword: #pfreq=noraman
keyword: PBEPBE/SDD
title: #p freq=noraman PBEPBE/SDD
converged: YES YES NO NO
title: Mulliken charges:
elementType: O O O O O O O O C C C C C C C C C C C C C C C C C C C C C H H H H H H H H H H H H H H
charge: -0.246760 -0.227964 -0.239545 -0.250222 -0.274063 -0.294509 -0.386480 -0.208338 -0.226145 0.064892 -0.195103 0.095514 0.293975 0.179477 0.243530 0.026963 -0.147765 0.219970 0.230800 -0.544401 0.188173 0.105326 0.046185 -0.352667 -0.379535 -0.336561 -0.400570 -0.199935 -0.507619 0.277684 0.274197 0.241236 0.269406 0.273973 0.262554 0.260141 0.269472 0.284009 0.241831 0.204892 0.241080 0.233496 0.389403
chargesum: 0.00000
title: Mulliken charges with hydrogens summed into heavy atoms:
elementType: O O O O O O O O C C C C C C C C C C C C C C C C C C C C C
charge: -0.246760 -0.227964 -0.239545 -0.250222 -0.274063 -0.294509 0.002923 -0.208338 0.051539 0.064892 0.079094 0.095514 0.293975 0.179477 0.243530 0.026963 0.093471 0.219970 0.230800 -0.001021 0.188173 0.105326 0.046185 -0.090113 -0.119395 -0.067088 -0.116561 0.041896 0.171849
polarizability: 3.08581129e+02 1.10561463e+01 2.15142192e+02 1.75322949e+01 1.42183111e+01 2.18149388e+02
1716.lowfreq: -7.8857 -0.0002 0.0003 0.0005 2.9705 6.9202 30.9758 51.9426 62.7420
frequency: 30.9465 51.9343 62.7318 67.1565 86.2649 103.9802 121.8240 128.6060 154.8035 175.4578 183.5362 203.1773 226.2230 242.2902 252.8717 300.2559 305.7815 309.4139 327.9084 339.1907 342.0211 357.2091 362.5636 392.2836 420.6169 436.4927 448.3494 465.0908 477.7489 488.0328 494.0443 503.5887 517.3396 531.3810 537.3242 579.2076 583.8637 601.3136 615.0775 617.0268 629.6240 679.8225 694.0269 715.6758 719.8762 744.3063 749.4345 762.8096 771.3873 776.3906 811.3252 821.7056 829.6573 834.0700 839.8078 854.2312 870.7687 886.5486 903.4860 923.6012 927.0843 965.3521 972.3209 982.3271 995.6470 999.3571 1023.6279 1045.1153 1050.1009 1061.7205 1064.9463 1093.5870 1104.9609 1113.7642 1129.4334 1148.3454 1150.9766 1175.4597 1180.6662 1192.1438 1216.0277 1232.5554 1247.9475 1255.1900 1262.6525 1283.1317 1293.8596 1300.6312 1325.0247 1329.1552 1333.7368 1372.7127 1379.3314 1397.3586 1417.3423 1423.1758 1433.7462 1435.5623 1447.0831 1453.8476 1454.0032 1461.4909 1478.7360 1555.9636 1582.7024 1589.5523 1592.0521 1621.3104 1631.4021 2946.8056 2958.3941 2985.5695 3019.1988 3062.6499 3094.0533 3116.8344 3132.9462 3146.4679 3161.8562 3163.5006 3165.6432 3176.6018 3185.6834
redmass: 7.2266 4.1038 3.6054 7.1559 2.0297 4.3777 7.6400 5.6506 6.0108 2.5238 3.7415 7.6168 6.0189 5.5203 7.0594 5.7221 6.3918 5.5461 6.1715 3.9364 5.9298 4.8254 6.7163 9.9550 7.9539 6.2839 9.0241 5.3167 6.0478 6.0655 7.0341 5.3748 6.9766 4.6805 5.8197 5.2996 5.6289 4.9922 5.5610 6.1511 4.4303 6.9579 5.7247 7.0715 5.9943 6.7783 5.9877 6.9867 4.1628 4.1624 2.2169 3.9172 3.0383 1.8788 4.7536 6.7459 1.0946 8.4763 5.1988 4.2397 1.6114 1.3475 3.8170 3.1868 1.4366 2.1077 2.1837 1.8196 3.8041 2.6400 2.8033 3.5240 2.1437 1.2526 2.0782 1.4326 1.6147 1.2566 1.6545 1.5027 1.9794 2.3079 2.6282 2.6168 3.4093 2.7765 2.3570 1.7613 1.5147 2.6440 1.4452 5.5323 2.5974 10.8367 1.1031 6.2471 1.3785 3.1512 3.3130 1.3624 1.8873 3.1387 1.0546 4.4185 9.2623 6.1292 7.4341 9.3357 6.6073 1.0691 1.0362 1.0837 1.0636 1.0964 1.0981 1.1026 1.0891 1.0873 1.0936 1.0890 1.0922 1.0990 1.0972
irintensity: 0.8223 2.5530 3.1893 0.6749 1.3177 1.4788 0.3029 1.5260 2.0183 2.5420 8.1670 1.2898 0.6751 3.8524 1.4282 1.9236 4.1913 10.6593 0.5522 3.7665 2.4988 3.7315 1.6992 4.6046 8.3696 10.2034 11.5173 0.6158 8.2689 22.0433 1.6108 2.5613 4.7082 5.0241 2.0391 4.2993 17.2428 7.8169 9.6218 10.0701 1.9817 12.4709 0.9716 13.3649 3.7870 4.8665 13.0103 8.4665 7.1735 11.0121 22.6676 12.0888 48.6183 91.7949 104.6302 17.5926 90.6577 75.5060 69.8912 11.5136 2.6005 0.2395 74.9742 71.2757 4.9282 43.6720 65.5461 7.7814 30.7253 92.9930 28.0534 60.7717 36.5989 0.5123 15.3033 13.8882 5.1461 14.7080 34.9624 25.3072 86.0073 247.1310 27.1319 41.1102 85.2457 46.6018 58.6882 28.6356 4.8117 23.7390 39.4753 44.4951 233.3976 4.6310 23.1235 9.0213 8.2650 3.5380 25.4473 67.1705 153.0952 131.3232 9.6076 133.9011 222.0504 34.3018 7.9336 33.5611 38.3942 137.5369 71.8069 30.9486 3.1275 33.7486 5.4328 24.5640 2.8568 7.0914 7.9034 0.6709 0.3344 10.6158 2.2226
temp: 298.150 k
press: 1.00000 atm
elementType: 8 8 8 8 8 8 8 8 6 6 6 6 6 6 6 6 6 6 6 6 6 6 6 6 6 6 6 6 6 1 1 1 1 1 1 1 1 1 1 1 1 1 1
symmnumber: 1
zpe: 806067.2 jmol-1
zpe.correction: 0.307015 hartree
zpe.thermalcorrener: 0.329220 hartree
zpe.thermalcorrenthalpy: 0.330164 hartree
zpe.thermalcorrgfe: 0.257026 hartree
zpe.sumelectzpe: -1408.341093 hartree
zpe.sumelectthermal: -1408.318888 hartree
zpe.sumelectthermalent: -1408.317944 hartree
zpe.sumelectthermalfe: -1408.391081 hartree
dipole: -0.1306 1.3130 0.9129
dipole: 1.6045
quadrupole: -200.9711 -158.7682 -150.5109
quadrupole: -7.0081 1.2091 2.4764
quadrupole: -30.8877 11.3152 19.5725 -7.0081 1.2091 2.4764
hfenergy: -1408.6481076 hartree
pointgroup: C01 [X(C21H14O8)]
dipole: 0.0799474 0.1698527 0.6026961 debye
polarizability: 306.8084369|-12.7610632|209.1273188|-19.9569311|12.7629305|225.9369529 unknown
InChI: InChI=1S/C21H14O8/c1-25-13-7-10(23)8-3-2-4-11-15(8)20(13)27-12-6-5-9(22)14-16(12)21(28-11,29-20)19-18(26-19)17(14)24/h2-6,13,18-19,22H,7H2,1H3
charge 0 multiplicity 1
43 atoms
O  -2.53568 -1.308138 2.423138
O  0.474511 -1.003243 1.260267
O  -0.231016 1.322504 1.156159
O  0.622874 -1.428263 -1.125803
O  3.401964 -1.419019 1.364414
O  -4.779784 0.79753 0.70261
O  -4.73351 0.113987 -1.800188
O  4.845941 0.074366 -2.030562
C  -1.548539 -0.197701 2.354269
C  -0.679608 -0.111424 1.115467
C  -3.004565 0.13332 2.197483
C  1.338442 -0.882587 0.07687
C  -1.400166 -0.402163 -0.18059
C  -3.577338 0.351739 0.825516
C  1.716776 0.564404 -0.147944
C  -2.777856 -0.05792 -0.327389
C  2.572487 -1.801399 0.229291
C  -0.713665 -1.001545 -1.244125
C  0.924679 1.59802 0.395281
C  3.449087 -1.643392 -1.024663
C  2.910517 0.893015 -0.844535
C  -3.422617 -0.244073 -1.594325
C  3.816425 -0.192344 -1.349197
C  -1.369697 -1.235489 -2.484007
C  1.284413 2.952664 0.232649
C  -2.70224 -0.843739 -2.664079
C  3.26991 2.249494 -1.02505
C  2.454985 3.270703 -0.490061
C  3.010272 -2.00728 2.655739
H  -1.031968 0.038505 3.291016
H  -3.569275 0.569599 3.026822
H  2.20846 -2.84535 0.330403
H  2.911922 -2.056825 -1.898973
H  4.38296 -2.21505 -0.899155
H  -0.807725 -1.706081 -3.296179
H  0.648691 3.729866 0.667057
H  -3.214593 -0.991723 -3.618286
H  4.192238 2.474512 -1.568824
H  2.731439 4.321043 -0.627871
H  2.924086 -3.110338 2.574785
H  2.054533 -1.590934 3.018724
H  3.826406 -1.751407 3.349044
H  -5.089877 0.524954 -0.931298
