program: Gaussian 09
title: 000189008
version: EM64L-G09RevD.01
frameworkgroup: C1[X(C12H20N4O3)]
method: RPBEPBE
basis: SDD
operation: Freq
keyword: #p
keyword: freq=noraman
keyword: PBEPBE/SDD
title: #p freq=noraman PBEPBE/SDD
converged: NO YES NO NO
title: Mulliken charges:
elementType: O O O N N N N C C C C C C C C C C C C H H H H H H H H H H H H H H H H H H H H
charge: -0.306917 -0.447881 -0.221946 -0.368521 -0.544818 -0.410656 -0.136785 -0.421467 -0.012909 -0.153734 -0.267967 -0.705509 -0.736743 0.224545 -0.530516 0.175655 0.437106 -0.471133 -0.246232 0.219469 0.220042 0.193768 0.278046 0.232067 0.336180 0.211226 0.216352 0.241762 0.212562 0.224504 0.220182 0.223240 0.257472 0.275363 0.285713 0.344724 0.265358 0.408487 0.279912
chargesum: 0.00000
title: Mulliken charges with hydrogens summed into heavy atoms:
elementType: O O O N N N N C C C C C C C C C C C C
charge: -0.306917 -0.039394 -0.221946 -0.032341 0.016258 -0.065932 -0.136785 0.018044 0.180858 0.124312 -0.035900 -0.036170 -0.079494 0.224545 -0.049804 0.175655 0.437106 -0.205775 0.033680
polarizability: 1.65274071e+02 -1.38560568e+01 1.65155177e+02 -6.11072338e-01 3.82992799e+00 1.46099831e+02
1716.lowfreq: -13.5719 -5.6668 -0.0004 0.0002 0.0003 5.9159 34.5083 46.1889 53.9572
frequency: 34.2770 46.0071 53.9188 67.4271 74.2760 78.9494 93.5982 97.6332 118.5991 160.0915 178.5799 183.0871 197.6982 234.3607 240.8376 269.9982 290.5123 305.1663 314.1358 320.2076 327.9672 368.4844 371.9995 404.3242 416.2541 503.4690 550.1456 572.0121 606.3569 615.2532 644.3990 654.0510 659.3002 679.0755 690.5810 706.2784 730.1997 749.4230 759.7416 782.4676 799.4982 827.7113 858.0545 890.8908 901.3970 917.6013 923.6460 931.5717 960.5408 983.4609 1005.0433 1018.6876 1059.3329 1075.5600 1089.8899 1095.3542 1118.6149 1124.8973 1134.2899 1145.6585 1199.0475 1208.8208 1216.4574 1228.6225 1243.0273 1249.6846 1262.5010 1291.9255 1305.2809 1306.8685 1320.1398 1336.4397 1341.3270 1348.5172 1361.4467 1365.1339 1374.6741 1376.9689 1399.1553 1434.6221 1448.9489 1449.4347 1466.3980 1476.5746 1485.5569 1489.7282 1511.6907 1564.1497 1600.1065 1646.0259 1651.0502 2954.7909 2966.7287 2981.8309 2987.6144 2999.0558 3008.7439 3033.4652 3042.4695 3062.8142 3066.0208 3071.6487 3086.8990 3091.3466 3227.0821 3246.3791 3395.5339 3434.9744 3538.4489 3552.2912 3561.7878
redmass: 4.4714 6.1000 4.1154 4.4517 3.5340 5.7616 4.2255 6.0113 4.9038 4.3549 3.7164 4.3131 4.4077 1.1680 2.2765 3.9130 1.5380 1.3676 2.7916 2.1742 2.1335 2.2437 3.3840 2.6881 3.6522 2.5497 2.3622 1.9610 2.5920 1.6441 3.4692 2.2474 3.4162 2.0176 1.2920 3.9151 3.1715 3.1297 3.8860 1.4388 3.3722 1.5286 2.4758 2.9525 5.4798 1.3705 1.6087 2.0644 1.5335 3.7597 3.4497 2.3816 2.2980 1.9107 2.5255 1.6629 1.8056 1.7514 2.0357 2.1996 1.6406 2.1515 1.6997 2.4561 1.4928 1.2829 1.2530 1.4543 1.7517 1.5007 1.3915 1.4908 1.4421 2.5289 1.4070 1.3217 2.7665 1.2440 1.2134 2.8932 1.0896 1.1046 1.0667 1.5450 1.0530 1.0865 1.1131 4.5913 5.2027 1.0925 9.3349 1.0810 1.0354 1.0401 1.0595 1.0770 1.0729 1.0841 1.1008 1.1002 1.0992 1.0988 1.0988 1.0982 1.0981 1.0998 1.0656 1.0452 1.0828 1.0768 1.0967
irintensity: 0.2812 10.1458 3.2270 1.4052 6.1253 10.0000 9.9214 1.6601 0.7674 3.0075 0.7361 2.5246 3.5705 3.2692 30.3980 9.5181 54.3469 11.5259 0.9061 1.6423 0.7451 1.6522 2.4561 4.1919 0.4861 34.6284 69.8790 172.0766 128.1293 70.9459 20.5971 104.0866 6.2665 222.8318 106.8812 8.9150 83.8481 0.1053 14.4184 26.5085 19.9212 33.4841 11.1506 21.1046 17.6073 2.7376 0.4776 14.6321 2.2758 4.8857 2.2689 9.4589 98.6487 35.5569 21.2064 16.7385 9.5012 0.6372 23.4903 23.2899 15.1008 8.6051 24.9109 8.9141 1.0463 3.1259 12.0798 7.2935 13.6495 13.2612 29.9067 5.3621 1.8160 4.4834 8.2870 2.6241 19.7687 12.7934 22.8410 9.9918 16.0308 9.3198 7.7387 218.7255 11.3304 22.6536 18.1333 17.0664 119.3960 38.2358 192.7893 19.8066 32.0053 34.4277 32.2141 7.3782 38.1312 2.7994 21.0144 35.3339 27.2122 59.0721 9.4845 38.3442 3.7703 1.2391 175.3074 2.1763 60.2056 42.2968 3.6364
temp: 298.150 k
press: 1.00000 atm
elementType: 8 8 8 7 7 7 7 6 6 6 6 6 6 6 6 6 6 6 6 1 1 1 1 1 1 1 1 1 1 1 1 1 1 1 1 1 1 1 1
symmnumber: 1
zpe: 845060.6 jmol-1
zpe.correction: 0.321867 hartree
zpe.thermalcorrener: 0.342038 hartree
zpe.thermalcorrenthalpy: 0.342982 hartree
zpe.thermalcorrgfe: 0.272922 hartree
zpe.sumelectzpe: -912.496789 hartree
zpe.sumelectthermal: -912.476618 hartree
zpe.sumelectthermalent: -912.475673 hartree
zpe.sumelectthermalfe: -912.545734 hartree
dipole: 1.2784 3.8976 1.0463
dipole: 4.2333
quadrupole: -111.2663 -121.2074 -116.4578
quadrupole: 2.9538 5.4087 3.7069
quadrupole: 5.0442 -4.8969 -0.1473 2.9538 5.4087 3.7069
hfenergy: -912.8186558 hartree
pointgroup: C01 [X(C12H20N4O3)]
dipole: 0.8049854 1.4353906 0.2559556 debye
polarizability: 159.6170888|-12.5988901|171.3230141|1.9011833|0.6865115|145.5889764 unknown
InChI: InChI=1S/C12H20N4O3/c1-7(2)3-10(12(18)19)16-11(17)9(13)4-8-5-14-6-15-8/h5-7,9-10,15-16,18H,3-4,13H2,1-2H3
charge 0 multiplicity 1
39 atoms
O  -0.866197 1.447994 -1.988425
O  0.626904 -1.314139 0.90096
O  1.063844 -2.355026 -1.138937
N  0.626907 1.100411 -0.221249
N  -1.783057 3.7401 -0.223372
N  -2.449782 -0.755067 -0.659372
N  -2.210863 -2.10967 1.129461
C  2.967823 0.365918 -0.917496
C  3.811625 0.182122 0.379907
C  1.434737 0.082098 -0.917487
C  -1.463423 2.371094 0.212223
C  4.09131 -1.302415 0.723842
C  3.256554 0.938694 1.612936
C  -0.532057 1.613326 -0.766723
C  -2.800076 1.558452 0.340233
C  1.04593 -1.328064 -0.428338
C  -2.611577 0.070891 0.467994
C  -2.47408 -0.793435 1.559567
C  -2.213526 -2.047784 -0.222578
H  3.069404 1.412459 -1.266923
H  3.410114 -0.277222 -1.703527
H  4.792523 0.642481 0.133307
H  1.10518 0.117495 -1.972722
H  -0.987776 2.428751 1.210328
H  0.754217 1.174109 0.78975
H  4.829126 -1.372252 1.544869
H  4.500682 -1.84616 -0.147309
H  3.179414 -1.827161 1.0571
H  3.02596 1.99466 1.375187
H  2.346874 0.445775 2.006158
H  4.000584 0.934587 2.430536
H  -3.404517 1.785642 -0.558886
H  -3.348602 1.957904 1.208862
H  -1.010106 4.405066 -0.110443
H  -2.156453 3.760154 -1.180779
H  -2.391444 -0.406949 -1.619755
H  -2.538958 -0.554303 2.618743
H  0.077396 -2.115566 1.144408
H  -2.031014 -2.884075 -0.892653
