program: Gaussian 09
title: 000189006
version: EM64L-G09RevD.01
frameworkgroup: C1[X(C8H10O2)]
method: RPBEPBE
basis: SDD
operation: Freq
keyword: #pfreq=noraman
keyword: PBEPBE/SDD
title: #p freq=noraman PBEPBE/SDD
converged: YES YES NO NO
title: Mulliken charges:
elementType: O O C C C C C C C C H H H H H H H H H H
charge: -0.201419 -0.364099 0.414635 0.443801 -0.372716 -0.341558 -0.386435 -0.379446 -0.407721 -0.804331 0.231619 0.238096 0.230666 0.230767 0.206651 0.212211 0.226014 0.225322 0.238403 0.359540
chargesum: 0.00000
title: Mulliken charges with hydrogens summed into heavy atoms:
elementType: O O C C C C C C C C
charge: -0.201419 -0.004559 0.414635 0.443801 -0.141097 -0.103462 -0.155769 -0.148678 0.011141 -0.114592
polarizability: 1.48708342e+02 -9.84803273e-01 8.88298363e+01 5.41899056e+00 1.82359760e+00 5.49478151e+01
1716.lowfreq: -8.5565 -2.2025 -0.0009 -0.0003 -0.0002 11.4040 24.9989 31.3455 68.3722
frequency: 24.8383 31.2736 68.3687 80.1235 92.8437 185.5003 280.3395 301.2249 344.8205 372.2064 406.2409 487.9253 539.6880 637.9049 715.4857 746.9925 805.8527 822.8689 845.4314 849.7471 923.2081 958.5566 969.7918 974.1774 1002.4253 1014.1760 1046.6097 1123.8616 1165.7807 1190.1890 1221.2730 1223.0498 1237.3283 1310.6705 1352.8494 1379.6209 1396.2144 1405.2369 1471.1755 1473.5255 1490.5820 1510.4036 1585.9223 1624.3166 2975.8423 2984.4059 3044.2324 3057.4543 3086.2573 3117.6358 3119.8606 3139.8508 3146.4004 3510.4837
redmass: 1.2427 2.4237 1.9733 1.7724 5.2379 4.1708 2.5157 6.7022 4.1144 2.4805 2.8236 3.2351 3.8249 6.7418 3.3355 3.6831 2.0781 4.4345 4.0677 1.2499 3.4565 1.5152 1.5094 1.3949 1.3911 2.8651 1.5760 1.2824 1.0913 1.1025 4.0674 2.1478 1.1813 1.2748 1.3755 5.3315 1.2238 2.9940 1.0977 1.0548 1.0980 2.7763 6.1807 6.4737 1.0386 1.0558 1.1089 1.0949 1.0998 1.0873 1.0877 1.0965 1.0977 1.0679
irintensity: 0.1300 2.4861 76.3370 69.3423 14.6492 1.1303 1.5915 9.8051 1.7187 0.1178 0.0580 19.3541 13.1345 0.0117 0.0713 11.4418 81.8904 14.7913 7.2600 0.0494 9.1710 0.1962 0.2196 0.0336 1.7312 2.9162 18.9339 9.5880 3.9284 4.9012 26.2496 2.6195 40.8001 0.3051 5.0924 0.2997 11.8579 2.9370 14.8870 12.8483 7.6589 13.2155 0.0279 21.9071 32.0593 45.4310 30.0732 23.3144 18.2695 5.7061 17.9528 40.5391 1.3287 23.3918
temp: 298.150 k
press: 1.00000 atm
elementType: 8 8 6 6 6 6 6 6 6 6 1 1 1 1 1 1 1 1 1 1
symmnumber: 1
zpe: 417933.6 jmol-1
zpe.correction: 0.159183 hartree
zpe.thermalcorrener: 0.170056 hartree
zpe.thermalcorrenthalpy: 0.171000 hartree
zpe.thermalcorrgfe: 0.120331 hartree
zpe.sumelectzpe: -460.460794 hartree
zpe.sumelectthermal: -460.449921 hartree
zpe.sumelectthermalent: -460.448977 hartree
zpe.sumelectthermalfe: -460.499646 hartree
dipole: 1.5708 0.8889 0.1055
dipole: 1.8079
quadrupole: -52.8852 -54.0741 -60.2409
quadrupole: -4.0216 -1.6932 1.1718
quadrupole: 2.8482 1.6593 -4.5075 -4.0216 -1.6932 1.1718
hfenergy: -460.619977 hartree
pointgroup: C01 [X(C8H10O2)]
dipole: -0.6188937 0.3502437 -0.0155694 debye
dipolederiv: 0.2038451 0.0142299 -0.0160829 0.0220353 -0.273385 0.0305049 0.051325 0.0146445 -0.3344538 -0.9133609 0.0215904 0.0620231 -0.042456 -0.2815577 -0.1702033 0.1034984 -0.1691547 -0.1315178 -0.1507374 -0.0062178 0.0134955 -0.0003457 -0.0416568 -0.0090741 0.0332668 -0.0055417 -0.1246886 0.4291764 0.009609 0.1041504 0.0113069 -0.0071531 0.0034441 0.1888134 0.0036529 0.0143144 0.0680581 0.057202 0.0289743 -0.0623981 0.0723842 0.0359353 0.0615391 0.017623 -0.137881 0.0730275 -0.0685562 0.0175829 0.0444616 0.0696664 -0.0073073 0.0277407 0.0083118 -0.1369501 -0.2326963 -0.098027 -0.0054406 -0.2006618 0.0490724 -0.0154247 -0.0408489 -0.0050855 -0.1676775 -0.2432135 0.0814659 0.0051582 0.1809672 0.0630296 0.0443769 -0.0136165 0.041857 -0.1617242 0.6028337 0.0018036 -0.0298601 0.0276518 0.3624503 0.0127931 -0.2596289 0.0237464 0.4968023 -0.1390338 -0.0058326 -0.0542486 -0.0082757 0.0793073 0.0000108 -0.1762468 -0.0032937 0.0279199 0.0356089 -0.0962276 -0.0344691 -0.08117 -0.0544918 -0.03302 -0.0267888 -0.0376239 0.1368762 0.0310329 0.0979026 -0.0238692 0.0857221 -0.0373487 0.0057165 -0.0138076 0.0099171 0.1419155 0.002138 0.1073007 -0.0148528 0.1031776 -0.055358 0.0033947 -0.0217884 -0.0001646 0.1496786 0.0169381 -0.0991204 -0.0275746 -0.0946218 -0.0639886 -0.0331662 -0.0311814 -0.0305128 0.1440688 -0.0022047 -0.0247512 -0.0139281 -0.0606439 -0.1065161 -0.1362359 0.0580195 -0.0646067 -0.034079 -0.0170997 0.0286826 -0.0327518 0.0616075 -0.067261 0.1316085 0.0552077 0.0557679 -0.0390064 0.0013439 -0.0409254 0.0087144 -0.1226523 -0.0752318 0.073729 0.0618857 0.0683357 0.0849594 -0.0048538 0.0432258 0.0156743 0.1251158 -0.0559482 -0.0831303 0.0752192 -0.0763643 0.0730825 -0.0051682 -0.0017894 -0.0350698 0.0017186 0.1135892 0.0063652 -0.0864575 0.0060819 -0.12614 0.2443657 -0.021565 0.0323746 0.0094608 0.3103975 0.1396826 -0.0461507 0.1424098 0.1245007 unknown
polarizability: 148.4680571|0.5522525|88.8348219|7.2318648|1.8329541|55.1831145 unknown
InChI: InChI=1S/C8H10O2/c1-7-2-4-8(5-3-7)6-10-9/h2-5,9H,6H2,1H3
charge 0 multiplicity 1
20 atoms
O  2.678971 0.012693 -0.583588
O  4.186764 -0.040411 -0.23459
C  0.531251 0.066482 0.453219
C  -2.275657 0.004036 -0.114785
C  -0.220479 1.265539 0.388183
C  -0.134129 -1.164835 0.227075
C  -1.60468 1.233393 0.11328
C  -1.516485 -1.194249 -0.050902
C  2.014716 0.096793 0.741841
C  -3.758212 -0.02816 -0.442652
H  0.279882 2.226701 0.557772
H  0.436201 -2.100291 0.269422
H  -2.172556 2.170962 0.075782
H  -2.015847 -2.1563 -0.218405
H  2.324991 1.033657 1.242606
H  2.340025 -0.769879 1.348558
H  -4.236875 -0.950474 -0.068885
H  -4.289656 0.83544 -0.005822
H  -3.921138 0.004987 -1.537638
H  4.539911 0.407313 -1.053568
