program: Gaussian 09
title: 000188982
version: EM64L-G09RevD.01
frameworkgroup: C1[X(C3H7NO)]
method: RPBEPBE
basis: SDD
operation: Freq
keyword: #pfreq=noraman
keyword: PBEPBE/SDD
title: #p freq=noraman PBEPBE/SDD
converged: YES YES NO NO
title: Mulliken charges:
elementType: O N C C C H H H H H H H
charge: -0.189489 -0.544379 -0.134106 -0.685844 -0.063041 0.225003 0.254933 0.212902 0.217839 0.269514 0.283657 0.153012
chargesum: 0.00000
title: Mulliken charges with hydrogens summed into heavy atoms:
elementType: O N C C C
charge: -0.189489 0.008792 0.090897 -0.000170 0.089970
polarizability: 4.65776337e+01 2.43660422e+00 4.33707406e+01 -1.19800961e+00 -2.48643927e+00 3.52395506e+01
1716.lowfreq: -0.0012 -0.0008 -0.0006 1.7326 6.9902 20.7596 79.2951 165.2371 218.2141
frequency: 79.2221 165.2172 218.2078 257.7597 336.7709 415.4176 646.8513 729.7145 787.9157 875.9040 921.6044 1000.4442 1074.9880 1170.8562 1241.5094 1275.6055 1322.5467 1375.4078 1386.8637 1467.5907 1480.6309 1641.8980 1654.6552 2844.6518 2938.3707 2986.8788 3081.2108 3106.4975 3436.9030 3554.0428
redmass: 2.1012 1.2343 1.1508 2.9673 2.3130 2.1957 2.2368 2.1173 3.1568 1.4482 1.7023 1.3942 1.7672 1.9203 1.6547 1.6983 1.2911 1.2780 1.2033 1.0469 1.0507 6.7910 1.1256 1.0848 1.0822 1.0361 1.0992 1.1001 1.0457 1.0954
irintensity: 39.6640 35.3560 5.2452 20.0607 8.3495 1.9704 63.3914 188.9355 9.7335 14.5451 5.0036 0.7417 14.4944 9.4291 3.6832 2.6605 0.3084 12.9198 9.3831 11.1007 9.9040 107.1150 67.7374 136.3844 38.4091 22.5042 36.0988 18.2221 0.5974 1.4306
temp: 298.150 k
press: 1.00000 atm
elementType: 8 7 6 6 6 1 1 1 1 1 1 1
symmnumber: 1
zpe: 260045.0 jmol-1
zpe.correction: 0.099046 hartree
zpe.thermalcorrener: 0.105530 hartree
zpe.thermalcorrenthalpy: 0.106475 hartree
zpe.thermalcorrgfe: 0.069329 hartree
zpe.sumelectzpe: -248.053065 hartree
zpe.sumelectthermal: -248.046581 hartree
zpe.sumelectthermalent: -248.045636 hartree
zpe.sumelectthermalfe: -248.082782 hartree
dipole: -1.6260 -1.2023 0.4497
dipole: 2.0717
quadrupole: -38.4485 -29.5256 -28.8575
quadrupole: 2.7238 2.7959 -1.7037
quadrupole: -6.1713 2.7516 3.4197 2.7238 2.7959 -1.7037
hfenergy: -248.152111 hartree
pointgroup: C01 [X(C3H7N1O1)]
dipole: 0.6505579 -0.4640476 -0.1604393 debye
dipolederiv: -0.864202 0.03458 0.1023818 0.1225987 -0.4391347 -0.0877044 0.2139967 -0.0698409 -0.3540036 -0.5608873 -0.2175649 0.0470124 -0.2091005 -0.7303182 -0.0673557 0.0414439 -0.0127608 -0.2496266 -0.1090535 -0.0464899 -0.0111546 0.0356456 0.489193 0.0931264 0.0684995 0.1780995 0.2710811 0.0007961 0.0363035 -0.0247855 -0.0609188 -0.0251114 0.0194018 -0.0009779 0.0358514 0.0946024 1.0118576 -0.0226289 -0.2074169 0.0889768 0.5378754 0.2373832 -0.2620554 0.2440806 0.1721794 0.0610878 -0.0134981 0.0205813 -0.0412062 0.0159363 -0.0266367 -0.0022041 -0.0571853 -0.1565357 -0.1148892 -0.0547941 0.0143278 -0.075134 0.0810864 0.0197003 0.007681 0.0191074 0.0903357 0.1111095 -0.0150114 -0.0254463 0.0265744 -0.1356314 -0.0612392 -0.0023771 -0.0875734 0.0571172 0.0620306 0.020973 0.0667536 0.0178064 0.0908686 -0.0179629 0.0014858 0.0201445 -0.1519776 0.2970885 0.0896877 0.0922129 0.0428532 0.1926973 0.0668404 0.00686 -0.0194817 0.0047419 0.1205228 0.2077958 -0.1020154 0.0887269 0.2116081 -0.0290622 -0.0746624 -0.0766198 0.1927768 -0.0154608 -0.0193528 0.0275489 -0.0368227 -0.2890692 -0.1464909 0.00231 -0.1738216 0.0293088 unknown
polarizability: 46.6965856|-2.5351365|43.1333265|-0.6651378|2.6879024|35.3580127 unknown
InChI: InChI=1S/C3H7NO/c1-3(4)2-5/h2-3H,4H2,1H3
charge 0 multiplicity 1
12 atoms
O  -1.911461 -0.122174 0.183218
N  0.523659 1.431486 0.083124
C  0.49007 0.045597 -0.397763
C  1.566055 -0.809163 0.317607
C  -0.877581 -0.653351 -0.285798
H  0.733971 0.038344 -1.484376
H  2.557662 -0.357542 0.150498
H  1.579334 -1.846257 -0.062439
H  1.377554 -0.84434 1.407126
H  0.51723 1.491576 1.108519
H  -0.230196 2.009924 -0.307226
H  -0.896097 -1.703801 -0.68419
