program: Gaussian 09
title: 000196941
version: EM64L-G09RevD.01
frameworkgroup: C1[X(C24H29NO)]
method: RPBEPBE
basis: SDD
operation: Freq
keyword: #p
keyword: freq=noraman
keyword: PBEPBE/SDD
title: #p freq=noraman PBEPBE/SDD
converged: YES YES NO NO
title: Mulliken charges:
elementType: O N C C C C C C C C C C C C C C C C C C C C C C C C H H H H H H H H H H H H H H H H H H H H H H H H H H H H H
charge: -0.235853 -0.002835 -0.158826 -0.109837 -0.155219 0.237658 0.231151 -0.536028 -0.518956 -0.478238 -0.582210 0.537996 -0.640085 0.368224 -0.492383 -0.823331 -0.413682 -0.809637 -0.563584 -0.585905 0.281681 0.178360 -0.315731 -0.485598 -0.194051 -0.365868 0.234821 0.208381 0.232492 0.213123 0.231741 0.213920 0.211803 0.223007 0.218827 0.224141 0.227862 0.221919 0.236073 0.219133 0.216908 0.235564 0.227149 0.227131 0.237679 0.220101 0.227340 0.235195 0.245895 0.231574 0.255205 0.244744 0.238482 0.228822 0.243754
chargesum: 0.00000
title: Mulliken charges with hydrogens summed into heavy atoms:
elementType: O N C C C C C C C C C C C C C C C C C C C C C C C C
charge: -0.235853 -0.002835 0.075994 0.098544 0.077273 0.237658 0.231151 -0.091163 -0.093233 -0.036403 -0.130207 0.537996 -0.182093 0.368224 -0.056341 -0.133487 -0.176003 -0.127001 -0.086114 -0.330700 0.281681 0.178360 -0.070988 -0.247115 0.034771 -0.122114
polarizability: 3.59131257e+02 1.59013417e+01 2.47072435e+02 1.34422691e-02 -9.05352116e+00 1.88862827e+02
1716.lowfreq: -10.8034 -7.7797 -0.0002 0.0004 0.0005 3.8954 23.9847 44.8185 48.5004
frequency: 23.9148 44.7787 48.4318 63.7815 66.0312 111.5555 146.2781 159.0909 171.2416 180.7546 187.2647 200.8909 218.2852 233.7419 242.7052 260.8214 268.7556 276.4847 296.0970 300.8107 317.6545 338.6040 364.0734 378.0372 384.2656 395.2153 415.6909 426.5393 450.7728 457.3329 484.7257 500.1378 527.2202 534.2468 558.4134 576.3085 607.0395 613.8783 637.9823 650.7046 672.0703 690.7983 706.5001 718.2025 741.6573 774.8314 800.9834 806.1015 820.9911 832.7522 837.2150 855.2388 879.9690 890.2368 908.9087 914.3619 921.3215 926.4037 936.7013 946.3492 958.1969 964.9995 968.9763 985.0776 991.4832 997.8258 1003.3905 1009.4206 1025.6757 1029.7472 1038.2187 1044.4619 1072.1396 1075.1170 1103.2043 1107.8700 1115.6650 1117.6565 1125.2766 1130.4749 1137.9693 1163.8352 1169.4073 1180.8407 1186.8076 1197.8770 1200.2072 1206.8325 1229.4714 1233.6292 1244.7349 1256.3196 1261.0915 1276.8529 1278.9863 1284.7806 1298.6755 1300.9333 1309.5625 1317.3937 1320.8859 1324.2581 1331.0625 1335.7775 1336.3889 1343.3867 1347.6886 1352.2506 1357.2967 1369.1532 1390.8780 1392.7551 1400.4102 1442.5925 1457.4204 1459.8474 1461.8139 1464.0456 1465.2646 1469.4621 1472.3103 1481.2664 1484.3610 1487.4300 1490.7162 1539.2193 1580.2045 1584.6458 1603.4566 1622.2326 2915.7271 2923.0216 2951.6118 2952.6364 2964.5384 2973.1749 2975.1386 2975.8849 2979.8275 2984.9225 2987.2525 2991.3561 3030.2490 3032.8771 3033.1265 3039.4602 3043.2059 3048.6520 3062.2962 3076.9262 3077.4265 3080.5579 3083.8859 3117.7201 3129.7948 3139.4300 3144.8140 3146.8641 3164.7114
redmass: 5.6081 4.4551 4.5453 4.4921 4.3084 3.7213 3.2965 2.6094 2.1952 3.5749 1.5490 3.0815 1.7528 1.9367 2.5866 2.4853 2.5615 2.4943 2.7420 2.4870 2.8397 4.1201 2.6834 2.8426 2.5007 2.9823 3.4129 3.5682 3.4087 3.6985 2.7663 3.4655 2.7801 2.7136 2.6963 3.4861 6.5114 3.8413 3.2488 4.1581 3.4469 4.7317 3.2698 1.9406 2.7380 2.1556 1.9279 1.6128 2.1500 2.0271 1.8561 2.3975 1.7330 1.8612 1.4419 1.8735 1.7321 1.7020 1.4993 1.8734 2.1842 2.2750 2.8320 1.5114 1.7790 2.2177 3.0478 2.0087 1.9929 1.8907 2.4444 2.3822 2.4261 2.5283 1.6511 1.6762 1.8751 2.3248 1.8353 1.8705 1.6551 2.2677 1.5408 1.7839 1.8116 1.9254 1.5153 1.6574 1.4279 1.8115 1.6702 1.6348 1.5136 1.5178 2.0377 1.3505 1.7767 1.9128 4.7346 1.4060 1.5120 1.3763 1.3499 1.3931 1.4875 2.0332 1.4406 1.3976 1.4288 1.4908 1.2068 1.2148 1.9991 1.0783 1.0863 1.0915 1.9980 1.0901 1.0852 1.0915 1.1231 1.0619 1.0616 1.0605 1.0645 5.0143 5.9254 10.0430 7.2103 7.7176 1.0815 1.0800 1.0663 1.0669 1.0682 1.0685 1.0653 1.0670 1.0609 1.0465 1.0360 1.0524 1.0943 1.0979 1.0975 1.0970 1.1004 1.0998 1.0954 1.0988 1.0985 1.0988 1.0987 1.0911 1.0865 1.0926 1.0938 1.0908 1.1004
irintensity: 1.2173 4.1988 0.7910 0.9709 0.3301 0.6454 1.3292 0.9753 1.4545 0.2007 0.2052 0.6171 0.1871 0.3250 0.4012 0.1409 0.4240 0.1416 0.6191 0.6271 2.5128 0.6356 2.1075 0.3952 1.3076 1.7937 0.1541 0.6667 1.6643 3.4697 0.3801 4.9274 0.1316 0.3260 1.0651 0.2583 1.4168 2.2537 0.4475 0.8691 10.7178 1.4926 1.2603 31.3248 0.8170 7.3671 12.9722 39.7357 10.2600 2.9013 6.2513 7.1428 10.4622 10.5078 1.9491 7.2791 9.6199 5.4472 1.3941 11.0038 6.2554 1.9473 18.3078 2.0085 3.7299 1.5600 6.6986 0.2871 4.7994 4.4337 1.3634 8.4382 1.7210 1.1602 1.6284 8.2875 7.6478 2.3742 3.9962 1.6014 2.2628 0.6071 7.3221 1.8040 27.4561 0.5395 6.0065 4.7191 20.1570 25.3921 1.8153 2.9390 4.7828 0.3219 35.4804 2.1030 3.0963 2.4458 1.1164 1.5064 11.5152 1.5003 2.5459 1.2093 0.8137 4.8517 1.2973 1.1277 7.6766 3.4959 11.1881 37.2292 18.1383 17.5848 21.1272 5.9833 19.7236 9.6073 12.9004 7.5476 9.5152 1.1698 13.5209 2.7017 12.5434 2.6314 0.4538 163.8081 21.8325 206.4078 7.2398 13.1657 23.9487 25.2977 17.7144 15.4653 43.5504 23.1657 34.7297 20.7369 0.4034 50.8755 23.3048 39.6432 30.5247 22.4791 81.3788 26.5665 22.8304 65.4107 13.1019 30.5907 27.2985 11.0059 1.3125 33.1936 8.3058 42.0892 24.9061
temp: 298.150 k
press: 1.00000 atm
elementType: 8 7 6 6 6 6 6 6 6 6 6 6 6 6 6 6 6 6 6 6 6 6 6 6 6 6 1 1 1 1 1 1 1 1 1 1 1 1 1 1 1 1 1 1 1 1 1 1 1 1 1 1 1 1 1
symmnumber: 1
zpe: 1235137.2 jmol-1
zpe.correction: 0.470439 hartree
zpe.thermalcorrener: 0.493155 hartree
zpe.thermalcorrenthalpy: 0.494099 hartree
zpe.thermalcorrgfe: 0.419656 hartree
zpe.sumelectzpe: -1059.991005 hartree
zpe.sumelectthermal: -1059.968290 hartree
zpe.sumelectthermalent: -1059.967345 hartree
zpe.sumelectthermalfe: -1060.041788 hartree
dipole: -3.5007 3.1291 1.1218
dipole: 4.8275
quadrupole: -202.6596 -152.9750 -156.9874
quadrupole: -5.9446 26.3148 -1.6500
quadrupole: -31.7856 17.8990 13.8866 -5.9446 26.3148 -1.6500
hfenergy: -1060.4614443 hartree
pointgroup: C01[X(C24H29N1O1)]
dipole: -1.373091 -1.2496672 -0.4002201 debye
polarizability: 359.2773894|-15.4148802|246.3569191|-0.1773629|-10.6540381|189.4322102 unknown
InChI: InChI=1S/C24H29NO/c1-23-11-9-18(26)14-17(23)5-6-19-21-8-7-20(16-4-3-13-25-15-16)24(21,2)12-10-22(19)23/h3-4,7,13-15,19,21-22H,5-6,8-12H2,1-2H3
charge 0 multiplicity 1
55 atoms
O  6.798571 0.922914 1.386356
N  -5.529059 1.953077 -0.404003
C  0.898099 -1.173436 -0.388488
C  1.434084 0.246551 -0.006517
C  -0.544602 -1.280568 0.133203
C  -1.517639 -0.22318 -0.495511
C  2.933292 0.500799 -0.457826
C  0.467476 1.387128 -0.44789
C  -1.017607 1.168125 -0.033511
C  1.810426 -2.261006 0.217462
C  -1.336213 -2.612217 0.062527
C  3.800764 -0.678313 0.023419
C  3.276584 -2.078642 -0.240873
C  -2.869552 -0.755316 0.053099
C  3.431695 1.82763 0.196869
C  -1.570416 -0.311535 -2.054227
C  -2.75383 -2.102294 0.28911
C  3.064046 0.597122 -2.01204
C  4.963875 2.00374 0.171917
C  5.01928 -0.501858 0.630255
C  -4.113906 0.026235 0.218853
C  5.678445 0.808443 0.79949
C  -5.113897 -0.377595 1.152388
C  -4.390256 1.211794 -0.524776
C  -6.301213 0.367669 1.282514
C  -6.469559 1.527175 0.488868
H  0.904974 -1.294151 -1.491915
H  1.454253 0.259773 1.108876
H  -0.503768 -1.028406 1.217731
H  0.516433 1.514861 -1.546008
H  0.807259 2.344636 -0.011223
H  -1.111414 1.237368 1.069244
H  -1.62623 1.989798 -0.457045
H  1.456043 -3.26774 -0.076184
H  1.75861 -2.208158 1.324662
H  -1.021423 -3.348648 0.82492
H  -1.23886 -3.112694 -0.925295
H  3.323253 -2.275682 -1.333702
H  3.935138 -2.823849 0.241425
H  3.093339 1.846291 1.25295
H  2.959287 2.689816 -0.308686
H  -1.827322 -1.333602 -2.385127
H  -2.341253 0.367921 -2.459608
H  -0.610615 -0.033859 -2.522663
H  -3.581508 -2.763665 0.568324
H  2.665418 -0.298401 -2.520424
H  2.520392 1.477399 -2.398189
H  4.1228 0.700426 -2.3096
H  5.274919 2.921049 0.702492
H  5.32871 2.104072 -0.871108
H  5.593297 -1.368457 0.984391
H  -4.942159 -1.257165 1.782295
H  -3.674718 1.584875 -1.263938
H  -7.078186 0.071303 1.994649
H  -7.37226 2.143349 0.567688
